Anethole
- Formula: C10H12O
- Molecular weight: 148.2017
- IUPAC Standard InChIKey: RUVINXPYWBROJD-ONEGZZNKSA-N
- CAS Registry Number: 4180-23-8
- Chemical structure:
View 3d structure (requires JavaScript / HTML 5) - Stereoisomers:
- Other names: trans-Anethole; (E)-Anethole; trans-Anethol; (E)-Anethol; p-Propenyl anisole; Anethole (E); Anethole, trans-; (E)-1-Methoxy-4(1-propenyl)benzene; E-trans-Anethole; (E)-Anetole

Phase change data

Data compiled as indicated in comments:
BS - Robert L. Brown and Stephen E. Stein
TRC - Thermodynamics Research Center, NIST Boulder Laboratories, Chris Muzny director
AC - William E. Acree, Jr., James S. Chickos
Quantity | Value | Units | Method | Reference | Comment |
---|---|---|---|---|---|
Tboil | 508.7 | K | N/A | Aldrich Chemical Company Inc., 1990 | BS |
Tboil | 508.85 | K | N/A | Lecat, 1947 | Uncertainty assigned by TRC = 0.7 K; TRC |
Tboil | 508.5 | K | N/A | Perkin, 1896 | Uncertainty assigned by TRC = 1. K; TRC |
Enthalpy of vaporization
ΔvapH (kJ/mol) | Temperature (K) | Method | Reference | Comment |
---|---|---|---|---|
78.3 | 348. | A | Stephenson and Malanowski, 1987 | Based on data from 333. to 363. K.; AC |

Kovats' RI, non-polar column, isothermal

Column type | Active phase | Temperature (C) | I | Reference | Comment |
---|---|---|---|---|---|
Capillary | SE-30 | 100. | 1265.2 | Tudor, 1997 | 40. m/0.35 mm/0.35 μm |

Kovats' RI, non-polar column, temperature ramp

Column type | Active phase | I | Reference | Comment |
---|---|---|---|---|
Capillary | HP-5MS | 1301. | Tepe, Askin Akpulat, et al., 2006 | 30. m/0.25 mm/0.25 μm, He, 3. K/min; Tstart: 50. C; Tend: 240. C |
Capillary | DB-1 | 1264. | Thangadurai, Anitha, et al., 2002 | 28. m/0.25 mm/0.25 μm, He, 50. C @ 1. min, 5.5 K/min; Tend: 270. C |
Capillary | PTE-5 | 1285. | Gudzic, Dordevic, et al., 2001 | 60. m/0.32 mm/0.39 μm, H2, 4.3 K/min; Tstart: 60. C; Tend: 285. C |
Capillary | PTE-5 | 1285. | Gudzic, Dordevic, et al., 2001 | 60. m/0.32 mm/0.39 μm, H2, 4.3 K/min; Tstart: 60. C; Tend: 285. C |
Capillary | DB-5 | 1283. | Adams, 2000 | 30. m/0.26 mm/0.25 μm, He, 3. K/min; Tstart: 60. C; Tend: 240. C |
Capillary | DB-5 | 1284. | Adams, 1999 | 30. m/0.26 mm/0.25 μm, He, 3. K/min; Tstart: 60. C; Tend: 246. C |
Capillary | DB-5 | 1247. | Senatore and de Feo, 1999 | 30. m/0.25 mm/0.33 μm, He, 40. C @ 5. min, 2. K/min, 260. C @ 20. min |

Kovats' RI, non-polar column, custom temperature program

Column type | Active phase | I | Reference | Comment |
---|---|---|---|---|
Capillary | SPB-1 | 1254. | Riu-Aumatell, Castellari, et al., 2004 | 30. m/0.25 mm/0.25 μm; Program: not specified |
Capillary | SPB-1 | 1254. | Riu-Aumatell, Castellari, et al., 2004 | 30. m/0.25 mm/0.25 μm; Program: not specified |
Capillary | DB-5 | 1283. | Adams, 1998 | 30. m/0.26 mm/0.25 μm; Program: not specified |
Packed | SE-30 | 1284. | Ramsey, Lee, et al., 1980 | He, Chromosorb G HP (80-100 mesh); Column length: 1.5 m; Program: not specified |

Kovats' RI, polar column, isothermal

Column type | Active phase | Temperature (C) | I | Reference | Comment |
---|---|---|---|---|---|
Capillary | Carbowax 20M | 150. | 1845. | Tudor, Moldovan, et al., 1999 | Phase thickness: 0.45 μm |

Kovats' RI, polar column, temperature ramp

Column type | Active phase | I | Reference | Comment |
---|---|---|---|---|
Capillary | Supelcowax | 1809. | Riu-Aumatell, Castellari, et al., 2004 | 30. m/0.25 mm/0.25 μm, 60. C @ 5. min, 3. K/min, 240. C @ 10. min |
Capillary | Supelcowax | 1819. | Riu-Aumatell, Castellari, et al., 2004 | 30. m/0.25 mm/0.25 μm, 60. C @ 5. min, 3. K/min, 240. C @ 10. min |
Capillary | Supelcowax-10 | 1847. | Wong and Teng, 1994 | He, 35. C @ 5. min, 3. K/min, 200. C @ 20. min; Column length: 60. m; Column diameter: 0.25 mm |

Van Den Dool and Kratz RI, non-polar column, temperature ramp

Column type | Active phase | I | Reference | Comment |
---|---|---|---|---|
Capillary | HP-5MS | 1284. | Benkaci-Ali, Baaliouamer, et al., 2007 | 30. m/0.25 mm/0.25 μm, He, 60. C @ 8. min, 2. K/min, 250. C @ 30. min |
Capillary | DB-1 | 1295. | Sonboli, Azizian, et al., 2007 | 60. m/0.25 mm/0.25 μm, N2, 5. K/min, 250. C @ 10. min; Tstart: 60. C |
Capillary | CP Sil 5 CB | 1275. | Andrianoelisoa H.S., Menut C., et al., 2006 | 30. m/0.25 mm/0.25 μm, N2, 5. K/min; Tstart: 50. C; Tend: 200. C |
Capillary | DB-5 | 1283. | Zeller and Rychlik, 2006 | 30. m/0.32 mm/0.25 μm, He, 40. C @ 1. min, 6. K/min; Tend: 230. C |
Capillary | CP Sil 5 CB | 1263. | Ziegenbein, Hanssen, et al., 2006 | H2, 10. K/min; Column length: 25. m; Column diameter: 0.25 mm; Tstart: 80. C; Tend: 270. C |
Capillary | DB-1 | 1247. | de Feo, Urrunaga Soria, et al., 2005 | 30. m/0.25 mm/0.25 μm, He, 40. C @ 5. min, 2. K/min, 260. C @ 20. min |
Capillary | HP-5 | 1285. | Flamini, Luigi Cioni, et al., 2005 | 30. m/0.25 mm/0.25 μm, N2, 60. C @ 10. min, 5. K/min; Tend: 220. C |
Capillary | HP-5MS | 1283. | Pino, Mesa, et al., 2005 | 30. m/0.25 mm/0.25 μm, He, 60. C @ 2. min, 4. K/min, 250. C @ 20. min |
Capillary | SPB-1 | 1256. | Antunes, Sevinate-Pinto, et al., 2004 | 30. m/0.25 mm/0.25 μm, He, 3. K/min, 220. C @ 15. min; Tstart: 70. C |
Capillary | HP-5 | 1290. | Bertoli, Menichini, et al., 2004 | 30. m/0.25 mm/0.25 μm, N2, 60. C @ 10. min, 5. K/min; Tend: 220. C |
Capillary | HP-5MS | 1249. | Garland, Menary, et al., 2004 | 30. m/0.22 mm/0.25 μm, N2, 60. C @ 1. min, 20. K/min, 290. C @ 10. min |
Capillary | BP-1 | 1260. | Gonny, Bradesi, et al., 2004 | 50. m/0.22 mm/0.25 μm, 2. K/min, 220. C @ 20. min; Tstart: 60. C |
Capillary | HP-5 | 1285. | Javidnia, Miri, et al., 2004 | 30. m/0.25 mm/0.25 μm, He, 3. K/min; Tstart: 60. C; Tend: 260. C |
Capillary | HP-5 | 1283. | Javidnia, Miri, et al., 2004, 2 | He, 3. K/min; Column length: 30. m; Column diameter: 0.25 mm; Tstart: 60. C; Tend: 260. C |
Capillary | SPB-5 | 1283. | Pino, Marbot, et al., 2004 | 30. m/0.25 mm/0.25 μm, He, 60. C @ 2. min, 4. K/min, 250. C @ 20. min |
Capillary | SPB-5 | 1282. | Pino, Marbot, et al., 2004, 2 | 30. m/0.25 mm/0.25 μm, He, 60. C @ 2. min, 4. K/min, 250. C @ 20. min |
Capillary | OV-1 | 1258. | Bicchi, Rubiolo, et al., 2003 | 25. m/0.25 mm/0.3 μm, H2, 50. C @ 1. min, 3. K/min, 200. C @ 20. min |
Capillary | DB-1 | 1276. | Boyom, Assembe, et al., 2003 | 30. m/0.25 mm/0.25 μm, N2, 5. K/min, 200. C @ 0. min; Tstart: 50. C |
Capillary | SPB-5 | 1283. | Pino, Marbot, et al., 2003 | 30. m/0.25 mm/0.25 μm, He, 60. C @ 2. min, 4. K/min, 250. C @ 20. min |
Capillary | DB-1 | 1252.4 | Sun and Stremple, 2003 | 30. m/0.25 mm/0.25 μm, He, 3. K/min; Tstart: 40. C; Tend: 325. C |
Capillary | DB-5 | 1284. | Javidnia, Miri, et al., 2002 | 30. m/0.25 mm/0.25 μm, He, 4. K/min; Tstart: 60. C; Tend: 260. C |
Capillary | SPB-5 | 1283. | Pino, Marbot, et al., 2002 | 30. m/0.25 mm/0.25 μm, He, 60. C @ 2. min, 4. K/min, 250. C @ 20. min |
Capillary | HP-5 | 1283. | Aligiannis, Kalpoutzakis, et al., 2001 | 30. m/0.25 mm/0.25 μm, He, 60. C @ 5. min, 3. K/min; Tend: 280. C |
Capillary | RTX-5 MS | 1288. | Hudaib, Grazia Bellardi, et al., 2001 | 30. m/0.25 mm/0.25 μm, He, 70. C @ 10. min, 4. K/min, 210. C @ 10. min |
Capillary | DB-1 | 1265. | Mirza and Sefidkon, 1999 | 60. m/0.25 mm/0.25 μm, He, 4. K/min; Tstart: 50. C; Tend: 220. C |
Capillary | OV-1 | 1259. | Bicchi, Fresia, et al., 1997 | 25. m/0.25 mm/0.3 μm, H2, 50. C @ 1. min, 3. K/min, 200. C @ 20. min |
Capillary | DB-1 | 1260. | Stashenko, Prada, et al., 1996 | 60. m/0.25 mm/0.25 μm, He, 50. C @ 5. min, 3.5 K/min; Tend: 250. C |
Capillary | DB-1 | 1270. | Stashenko, Martinez, et al., 1995 | 60. m/0.25 mm/0.25 μm, He, 40. C @ 3. min, 2. K/min, 160. C @ 15. min |

Van Den Dool and Kratz RI, non-polar column, custom temperature program

Column type | Active phase | I | Reference | Comment |
---|---|---|---|---|
Capillary | HP-5MS | 1280. | Pérez, Navarro, et al., 2007 | 30. m/0.25 mm/0.25 μm, He; Program: 50C(4min) => 10C/min => 200C(0.5min) => 20C/min => 260C(5min) |
Capillary | BPX-5 | 1307. | Cardeal, da Silva, et al., 2006 | 30. m/0.25 mm/0.25 μm; Program: 35C(5min) => 3C/min => 210C => 40C/min => 240C (4min) |
Capillary | SE-52 | 1253. | Guerrini, Sacchetti, et al., 2006 | 30. m/0.32 mm/0.15 μm, He; Program: 45C => 1C/min => 100C => 5C/min => 250C (10min) |
Capillary | DB-5 | 1276. | Moon, Cliff, et al., 2006 | 30. m/0.32 mm/0.25 μm, He; Program: 40C(3min) => 3C/min => 180C => 10C/min => 260C(2min) |
Capillary | SE-52 | 1285. | Sacchetti, Guerrini, et al., 2006 | 30. m/0.32 mm/0.15 μm, He; Program: 45C => 1C/min => 100C => 5C/min => 250C(10min) |
Capillary | CP Sil 8 CB | 1285. | Fuhrmann and Grosch, 2002 | 25. m/0.32 mm/0.25 μm, He; Program: 35C(2min) => 5C/min => 170C => 20C/min => 240C (10min) |
Capillary | HP-5 | 1271. | García, Alvarez, et al., 2002 | 50. m/0.2 mm/0.33 μm, He; Program: 50C(2min) => 5C/min => 150C => 10C/min => 250C(30min) |
Capillary | SE-52 | 1283. | Loayza, de Groot, et al., 1999 | 25. m/0.25 mm/0.25 μm, He; Program: 60 0C (8 min) 3 K/min -> 180 0C 20 K/min -> 230 0C |
Capillary | SE-52 | 1286. | Mondello, Dugo, et al., 1995 | 60. m/0.32 mm/0.40 μm, He; Program: 45 C (6 min) 3 C/min -> 111 0C 2 C/min -> 160 C 3 C/min -> 300 C (15 min) |

Van Den Dool and Kratz RI, polar column, temperature ramp

Column type | Active phase | I | Reference | Comment |
---|---|---|---|---|
Capillary | DB-FFAP | 1830. | Zeller and Rychlik, 2006 | 30. m/0.32 mm/0.25 μm, He, 40. C @ 1. min, 6. K/min; Tend: 230. C |
Capillary | BP-20 | 1830. | Gonny, Bradesi, et al., 2004 | 50. m/0.22 mm/0.25 μm, 2. K/min, 220. C @ 20. min; Tstart: 60. C |
Capillary | Carbowax 20M | 1812. | Bicchi, Rubiolo, et al., 2003 | 25. m/0.25 mm/0.3 μm, He, 50. C @ 1. min, 3. K/min, 200. C @ 20. min |
Capillary | Supelcowax-10 | 1834. | Chung, Yung, et al., 2002 | 60. m/0.25 mm/0.25 μm, He, 35. C @ 5. min, 2. K/min, 195. C @ 90. min |
Capillary | Supelcowax-10 | 1835. | Chung, 2000 | 60. m/0.25 mm/0.25 μm, He, 2. K/min, 195. C @ 90. min; Tstart: 35. C |
Capillary | Carbowax 20M | 1838. | Bicchi, Fresia, et al., 1997 | 25. m/0.25 mm/0.3 μm, 50. C @ 1. min, 3. K/min, 200. C @ 20. min |
Capillary | DB-Wax | 1837. | Stashenko, Prada, et al., 1996 | 60. m/0.25 mm/0.25 μm, He, 50. C @ 5. min, 2.5 K/min; Tend: 180. C |
Capillary | Carbowax 20M | 1814. | Mondello, Dugo, et al., 1995 | 60. m/0.32 mm/0.425 μm, He, 45. C @ 3. min, 3. K/min, 300. C @ 20. min |
Capillary | DB-Wax | 1838. | Stashenko, Martinez, et al., 1995 | 60. m/0.25 mm/0.25 μm, He, 40. C @ 3. min, 2. K/min, 160. C @ 15. min |
Capillary | Carbowax 20M | 1803. | Chen and Ho, 1988 | He, 1.5 K/min, 225. C @ 80. min; Column length: 60. m; Column diameter: 0.32 mm; Tstart: 50. C |

Van Den Dool and Kratz RI, polar column, custom temperature program

Column type | Active phase | I | Reference | Comment |
---|---|---|---|---|
Capillary | FFAP | 1828. | Fuhrmann and Grosch, 2002 | 25. m/0.32 mm/0.3 μm, He; Program: 35C(2min) => 5C/min => 170C => 20C/min => 240C (10min) |

Normal alkane RI, non-polar column, temperature ramp

Column type | Active phase | I | Reference | Comment |
---|---|---|---|---|
Capillary | DB-5 MS | 1267. | Cui, Yang, et al., 2011 | 30. m/0.25 mm/0.25 μm, Helium, 3. K/min; Tstart: 60. C; Tend: 270. C |
Capillary | ZB-5 | 1304. | Vazquez, Demmel, et al., 2011 | 30. m/0.25 mm/0.25 μm, Nitrogen, 40. C @ 5. min, 5. K/min, 200. C @ 5. min |
Capillary | RTX-1 | 1262. | Dib, Djabou, et al., 2010 | 60. m/0.22 mm/0.25 μm, Helium, 2. K/min, 230. C @ 30. min; Tstart: 60. C |
Capillary | HP-5 MS | 1290. | Radulovic, Blagojevic, et al., 2010 | 30. m/0.25 mm/0.25 μm, Helium, 5. K/min, 290. C @ 10. min; Tstart: 70. C |
Capillary | DB-5 | 1285. | Scrivanti, Anton, et al., 2009 | 30. m/0.25 mm/0.25 μm, Nitrogen, 2. K/min; Tstart: 40. C; Tend: 230. C |
Capillary | HP-5 MS | 1280. | Araque, Rojas, et al., 2007 | 30. m/0.25 mm/0.25 μm, Helium, 4. K/min, 200. C @ 20. min; Tstart: 60. C |
Capillary | DB-5MS | 1264. | Marongiu B., Piras A., et al., 2007 | 30. m/0.25 mm/0.25 μm, He, 3. K/min, 280. C @ 30. min; Tstart: 60. C |
Capillary | DB-1 | 1279. | Salehi, Asghari, et al., 2007 | 60. m/0.25 mm/0.25 μm, 5. K/min; Tstart: 60. C; Tend: 250. C |
Capillary | DB-5 | 1285. | Smelcerovic, Spiteller, et al., 2007 | 30. m/0.25 mm/0.25 μm, He, 10. K/min, 320. C @ 4. min; Tstart: 60. C |
Capillary | DB-5 | 1283. | Zeller and Rychlik, 2007 | 25. m/0.32 mm/0.25 μm, He, 40. C @ 1. min, 6. K/min; Tend: 230. C |
Capillary | HP-5 | 1285. | Miyazawa and Kawata, 2006 | 30. m/0.32 mm/0.25 μm, Helium, 4. K/min, 240. C @ 5. min; Tstart: 40. C |
Capillary | NB-30 | 1264. | Orav, Raal, et al., 2006 | 30. m/0.2 mm/0.25 μm, He, 2. K/min; Tstart: 50. C; Tend: 250. C |
Capillary | SE-52 | 1283. | Ozcan, Chalchat, et al., 2006 | Helium, 3. K/min; Column length: 50. m; Column diameter: 0.25 mm; Tstart: 50. C; Tend: 240. C |
Capillary | SPB-5 | 1283. | Pino, Marquez, et al., 2006 | 30. m/0.25 mm/0.25 μm, Helium, 60. C @ 2. min, 4. K/min, 250. C @ 20. min |
Capillary | Ultra-2 | 1294. | Schlumpberger B.O., Clery R.A., et al., 2006 | 50. m/0.25 mm/0.32 μm, He, 2. K/min; Tstart: 50. C; Tend: 270. C |
Capillary | HP-1 | 1264. | Bendimerad and Bendiab, 2005 | 50. m/0.2 mm/0.5 μm, He, 2. K/min, 250. C @ 60. min; Tstart: 60. C |
Capillary | DB-1 | 1273. | Fakhari A.R., Sonboli A., et al., 2005 | 60. m/0.25 mm/0.25 μm, N2, 5. K/min, 250. C @ 10. min; Tstart: 60. C |
Capillary | RSL-200 | 1281. | Jirovetz, Buchbauer, et al., 2005 | 30. m/0.25 mm/0.25 μm, 40. C @ 2. min, 6. K/min, 280. C @ 10. min |
Capillary | DB-1 | 1281. | Khajeh, Yamini, et al., 2005 | 60. m/0.25 mm/0.25 μm, He, 50. C @ 5. min, 4. K/min; Tend: 250. C |
Capillary | HP-5 | 1289.2 | Leffingwell and Alford, 2005 | 60. m/0.32 mm/0.25 μm, He, 30. C @ 2. min, 2. K/min, 260. C @ 28. min |
Capillary | DB-1 | 1300. | Pala-Paul, Perez-Alonso, et al., 2005 | 50. m/0.25 mm/0.25 μm, N2, 4. K/min; Tstart: 95. C; Tend: 240. C |
Capillary | RTX-1 | 1263. | Sonboli A., Fakhari A.R., et al., 2005 | 60. m/0.25 mm/0.25 μm, He, 5. K/min, 250. C @ 10. min; Tstart: 60. C |
Capillary | BP-1 | 1259. | Srivastava, Srivastava, et al., 2005 | 30. m/0.32 mm/0.25 μm, N2, 5. K/min, 220. C @ 15. min; Tstart: 60. C |
Capillary | DB-5 | 1285. | JAvidnia, Mojab, et al., 2004 | 25. m/0.25 mm/0.25 μm, Nitrogen, 3. K/min; Tstart: 60. C; Tend: 240. C |
Capillary | HP-5MS | 1283. | Malencic, Couladis, et al., 2004 | 30. m/0.25 mm/0.25 μm, He, 3. K/min; Tstart: 60. C; Tend: 280. C |
Capillary | DB-5 | 1283. | Miyazawa, Fuhita, et al., 2004 | Helium, 2. K/min, 240. C @ 999. min; Column length: 30. m; Column diameter: 0.25 mm; Tstart: 60. C |
Capillary | DB-5 | 1283. | Miyazawa, Fujita, et al., 2004 | Helium, 2. K/min, 240. C @ 999. min; Column length: 50. m; Column diameter: 0.25 mm; Tstart: 60. C |
Capillary | DB-1 | 1255. | Park, Lee, et al., 2004 | 60. m/0.32 mm/0.25 μm, He, 35. C @ 4. min, 2. K/min, 230. C @ 25. min |
Capillary | DB-1 | 1257. | Park, Lee, et al., 2004 | 60. m/0.32 mm/0.25 μm, He, 35. C @ 4. min, 2. K/min, 230. C @ 25. min |
Capillary | DB-1 | 1257. | Park, Lee, et al., 2004 | 60. m/0.32 mm/0.25 μm, He, 35. C @ 4. min, 2. K/min, 230. C @ 25. min |
Capillary | DB-1 | 1259. | Park, Lee, et al., 2004 | 60. m/0.32 mm/0.25 μm, He, 35. C @ 4. min, 2. K/min, 230. C @ 25. min |
Capillary | DB-5 | 1281. | Tellez, Khan, et al., 2004 | 30. m/0.25 mm/0.25 μm, He, 3. K/min; Tstart: 60. C; Tend: 240. C |
Capillary | CP Sil 8 CB | 1295. | Wang, Guo, et al., 2004 | 30. m/0.32 mm/0.25 μm, 50. C @ 5. min, 5. K/min; Tend: 200. C |
Capillary | DB-1 | 1253. | Fekam Boyom, Ngouana, et al., 2003 | 30. m/0.25 mm/0.25 μm, N2, 5. K/min; Tstart: 50. C; Tend: 200. C |
Capillary | DB-5 | 1283. | Pino, Marbot, et al., 2003, 2 | 30. m/0.25 mm/0.25 μm, H2, 60. C @ 10. min, 4. K/min, 280. C @ 40. min |
Capillary | NB-30 | 1264. | Raal, Arak, et al., 2003 | 50. m/0.2 mm/0.5 μm, He, 2. K/min; Tstart: 50. C; Tend: 250. C |
Capillary | PTE-5 | 1283. | Gudzic, Djokovic, et al., 2002 | 60. m/0.32 mm/0.30 μm, H2, 4.3 K/min; Tstart: 60. C; Tend: 285. C |
Capillary | SE-30 | 1271. | Iñigo, Palá-Paúl, et al., 2002 | 50. m/0.25 mm/0.25 μm, He, 4. K/min; Tstart: 70. C; Tend: 240. C |
Capillary | HP-5 | 1287. | Lockwood, Asghari, et al., 2002 | 30. m/0.25 mm/0.25 μm, 60. C @ 4. min, 4. K/min; Tend: 275. C |
Capillary | CP Sil 5 CB | 1272. | Mojab, Rustaiyan, et al., 2002 | 25. m/0.25 mm/0.39 μm, He, 5. K/min; Tstart: 60. C; Tend: 220. C |
Capillary | SPB-5 | 1283. | Pino, Marbot, et al., 2002, 2 | 30. m/0.25 mm/0.25 μm, Helium, 60. C @ 2. min, 4. K/min, 250. C @ 20. min |
Capillary | DB-1 | 1261. | Yamini, Sefidkon, et al., 2002 | 60. m/0.25 mm/0.25 μm, He, 50. C @ 5. min, 4. K/min; Tend: 250. C |
Capillary | Optima-1 | 1266. | Brun, Bessière, et al., 2001 | 25. m/0.20 mm/0.25 μm, He, 50. C @ 3. min, 3. K/min; Tend: 250. C |
Capillary | OV-101 | 1260. | Orav and Kann, 2001 | He, 2. K/min; Column length: 50. m; Column diameter: 0.2 mm; Tstart: 50. C; Tend: 250. C |
Capillary | Optima-1 | 1267. | de Beck, Bessière, et al., 2000 | 25. m/0.20 mm/0.25 μm, He, 50. C @ 3. min, 3. K/min; Tend: 250. C |
Capillary | SPB-1 | 1285. | Fraternale, Giamperi, et al., 2000 | 30. m/0.2 mm/0.2 μm, He, 80. C @ 3. min, 5. K/min; Tend: 300. C |
Capillary | OV-1 | 1251. | Bicchi, Binello, et al., 1999 | 25. m/0.32 mm/0.30 μm, Hydrogen, 50. C @ 1. min, 3. K/min, 200. C @ 10. min |
Capillary | OV-1 | 1252. | Bicchi, Binello, et al., 1999 | 25. m/0.32 mm/0.30 μm, Hydrogen, 50. C @ 1. min, 3. K/min, 200. C @ 10. min |
Capillary | OV-1 | 1252. | Bicchi, Binello, et al., 1999 | 25. m/0.32 mm/0.30 μm, Hydrogen, 50. C @ 1. min, 3. K/min, 200. C @ 10. min |
Capillary | OV-101 | 1273. | Menon, Chacko, et al., 1999 | N2, 1. K/min, 200. C @ 20. min; Column length: 50. m; Column diameter: 0.2 mm; Tstart: 80. C |
Capillary | CBP-1 | 1264. | Lamarque, Maestri, et al., 1998 | He, 4. K/min; Column length: 30. m; Column diameter: 0.25 mm; Tstart: 60. C; Tend: 240. C |
Capillary | CP Sil 5 CB | 1249. | Bos, Woerdenbag, et al., 1997 | 25. m/0.32 mm/0.25 μm, N2, 4. K/min; Tstart: 50. C; Tend: 290. C |
Capillary | DB-1 | 1270. | Sagrero-Nieves and Bartley, 1996 | 60. m/0.32 mm/0.50 μm, He, 50. C @ 1. min, 8. K/min, 250. C @ 6. min |
Capillary | DB-1 | 1255. | Stashenko, Torres, et al., 1995 | 60. m/0.25 mm/0.25 μm, He, 50. C @ 5. min, 3.5 K/min; Tend: 250. C |
Capillary | OV-101 | 1270. | Egolf and Jurs, 1993 | 2. K/min; Column length: 50. m; Column diameter: 0.22 mm; Tstart: 80. C; Tend: 200. C |
Capillary | OV-101 | 1260. | Tkachenko and Zenkevich, 1993 | Helium, 40. C @ 0. min, 3. K/min, 200. C @ 0. min; Column length: 52. m; Column diameter: 0.26 mm |
Capillary | BP-1 | 1258. | Wyllie, Brophy, et al., 1990 | 45. C @ 3. min, 3. K/min; Column length: 25. m; Column diameter: 0.33 mm; Tend: 180. C |

Normal alkane RI, non-polar column, custom temperature program

Column type | Active phase | I | Reference | Comment |
---|---|---|---|---|
Capillary | DB-1 | 1254. | Albano, Lima, et al., 2012 | 30. m/0.25 mm/0.25 μm, Hydrogen; Program: 45 0C 3 0C/min -> 175 0C 15 0C/min -> 300 0C (10 min) |
Capillary | SLB-5 MS | 1288. | Mondello, 2012 | 30. m/0.25 mm/0.25 μm, Helium; Program: not specified |
Capillary | SLB-5 MS | 1292. | Mondello, 2012 | 30. m/0.25 mm/0.25 μm, Helium; Program: not specified |
Capillary | ZB-5 | 1301. | Vazquez, Demmel, et al., 2011 | 30. m/0.25 mm/0.25 μm, Nitrogen; Program: not specified |
Capillary | RTX-1 | 1260. | Dib, Djabou, et al., 2010 | 60. m/0.22 mm/0.25 μm, Helium; Program: not specified |
Capillary | RTX-5 MS | 1290. | Mebazaa, Mahmoudi, et al., 2009 | 30. m/0.25 mm/0.25 μm, Helium; Program: 50 0C (5 min) 2 0C/min -> 100 0C (5 min) 5 0C/min -> 300 0C |
Capillary | RTX-5 MS | 1289. | Mebazaa, Mahmoudi, et al., 2009 | 30. m/0.25 mm/0.25 μm, Helium; Program: not specified |
Capillary | CB-1 | 1270. | Kannaste, Vongvanich, et al., 2008 | 30. m/0.25 mm/0.25 μm, Helium; Program: 40 0C (2 min) 4 0C/min -> 180 0C 20 0C/min -> 220 0C (1 min) |
Capillary | CB-1 | 1262. | Kannaste, Vongvanich, et al., 2008 | 30. m/0.25 mm/0.25 μm, Helium; Program: not specified |
Capillary | HP-5MS | 1274. | Ning, Zheng, et al., 2008 | 30. m/0.25 mm/0.25 μm, He; Program: 40 0C (2 min) 3 0C/min -> 180 0C (2 min) 15 0C -> 280 0C |
Capillary | HP-5 MS | 1290. | Xie, Sun, et al., 2008 | 30. m/0.25 mm/0.25 μm, Helium; Program: 40 0C (2 min) 4 0C/min -> 220 0C 20 0C/min -> 280 0C |
Capillary | HP-5 MS | 1292. | Xie, Sun, et al., 2008 | 30. m/0.25 mm/0.25 μm, Helium; Program: 40 0C (2 min) 4 0C/min -> 220 0C 20 0C/min -> 280 0C |
Capillary | DB-5 MS | 1281. | Liu, Xu, et al., 2007 | 60. m/0.32 mm/1.0 μm, Helium; Program: 40 0C (2 min) 6 0C/min -> 100 0C 4 0C/min -> 180 0C 8 0C/min -> 250 0C (12 min) |
Capillary | DB-5MS | 1288. | Polzin, Stanfill, et al., 2007 | Column length: 30. m; Program: not specified |
Capillary | DB-5 | 1285. | Santos, Santiago, et al., 2007 | 30. m/0.25 mm/0.25 μm, Hydrogen; Program: 35 0C 4 0C/min -> 180 0C 17 0C/min -> 280 0C (10 min) |
Capillary | HP-5 | 1303. | Jordan, Martinez, et al., 2006 | 30. m/0.25 mm/0.25 μm, He; Program: 60C(4min) => 1C/min => 64C => 2.5C/min => 155C => 5C/min => 250C |
Capillary | DB-1 | 1284. | de Lima, Maia, et al., 2006 | He; Column length: 30. m; Column diameter: 0.25 mm; Program: 35C => 4C/min => 180C => 10C/min => 250C |
Capillary | BPX-5 | 1283. | Koutsoudaki, Krsek, et al., 2005 | 30. m/0.32 mm/0.5 μm, He; Program: 60C(1min) => 3.5C/min => 180C => 20C/min => 280C(2min) |
Capillary | Polydimethyl siloxane with 5 % Ph groups | 1282. | Pino, Marbot, et al., 2005 | Program: not specified |
Capillary | DB-5 | 1282. | Lo Cantore, Iacobellis, et al., 2004 | Program: not specified |
Capillary | DB-1 | 1253. | Silva, Matos, et al., 2004 | 30. m/0.25 mm/0.25 μm, Helium; Program: 35 0C 4 0C/min -> 180 0C 10 0C/min -> 250 0C |
Capillary | HP-5 | 1303. | Sotomayor, Martínez, et al., 2004 | 30. m/0.25 mm/0.25 μm, He; Program: 60C(4min) => 1C/min => 64C => 2.5C/min => 155C => 5C/min => 250C |
Capillary | SE-30 | 1258. | Vinogradov, 2004 | Program: not specified |
Capillary | HP-5 | 1253. | Güllüce, Sökmen, et al., 2003 | 30. m/0.25 mm/0.25 μm, He; Program: 50C(3min) => 3C/min => 150C(10min) => 10 C/min => 250C |
Capillary | HP-5 | 1303. | Jordán, Martínez, et al., 2003 | 30. m/0.25 mm/0.25 μm, He; Program: 60C (4min) => 1C/min => 64C => 2.5C/min => 155C => 5C/min => 250C |
Capillary | DB-1 | 1254. | Baratta, Dorman, et al., 1998 | 30. m/0.25 mm/0.25 μm, He; Program: 45C => 3C/min => 175C => 15C/min => 240C (10min) |
Capillary | DB-5 | 1287. | Anitescu, Doneanu, et al., 1997 | 15. m/0.25 mm/0.25 μm, He; Program: 40C(5min) => 5C/min => 120C(10min) => 4C/min => 250C(4min) => 5C/min => 280C |
Capillary | Polydimethyl siloxanes | 1268. | Zenkevich, 1997 | Program: not specified |
Capillary | Methyl Silicone | 1264. | Grundschober, 1991 | Program: not specified |
Capillary | OV-101 | 1270. | Shibamoto, 1987 | Program: not specified |
Capillary | OV-1, SE-30, Methyl silicone, SP-2100, OV-101, DB-1, etc. | 1284. | Waggott and Davies, 1984 | Hydrogen; Column length: 50. m; Column diameter: 0.32 mm; Program: not specified |
Other | Methyl Silicone | 1284. | Ardrey and Moffat, 1981 | Program: not specified |

Normal alkane RI, polar column, temperature ramp

Column type | Active phase | I | Reference | Comment |
---|---|---|---|---|
Capillary | DB-FFAP | 1830. | Zeller and Rychlik, 2007 | 30. m/0.32 mm/0.25 μm, He, 40. C @ 1. min, 6. K/min; Tend: 230. C |
Capillary | NB-20M | 1834. | Orav, Raal, et al., 2006 | 30. m/0.2 mm/0.25 μm, He, 2. K/min; Tstart: 50. C; Tend: 250. C |
Capillary | Innowax | 1798. | Bendimerad and Bendiab, 2005 | 50. m/0.2 mm/0.5 μm, He, 2. K/min, 250. C @ 60. min; Tstart: 60. C |
Capillary | DB-Wax | 1802. | Fakhari A.R., Sonboli A., et al., 2005 | 30. m/0.25 mm/0.25 μm, N2, 5. K/min, 250. C @ 10. min; Tstart: 60. C |
Capillary | DB-Wax | 1820. | Dregus and Engel, 2003 | 60. m/0.32 mm/0.25 μm, H2, 40. C @ 5. min, 4. K/min, 230. C @ 25. min |
Capillary | DB-Wax | 1818. | Lin, Cai, et al., 2003 | 30. m/0.25 mm/0.25 μm, He, 50. C @ 2. min, 3. K/min, 230. C @ 20. min |
Capillary | TC-Wax | 1829. | Miyazawa, Yamafuji, et al., 2003 | 3. K/min; Column length: 60. m; Column diameter: 0.25 mm; Tstart: 80. C; Tend: 240. C |
Capillary | SW-10 | 1820. | Raal, Arak, et al., 2003 | 50. m/0.20 mm/0.25 μm, He, 2. K/min; Tstart: 50. C; Tend: 250. C |
Capillary | PEG-20M | 1819. | Orav and Kann, 2001 | He, 2. K/min; Column length: 50. m; Column diameter: 0.2 mm; Tstart: 70. C; Tend: 220. C |
Capillary | CW 20M | 1805. | Bicchi, Binello, et al., 1999 | 25. m/0.32 mm/0.25 μm, Hydrogen, 50. C @ 1. min, 3. K/min, 220. C @ 10. min |
Capillary | CW 20M | 1807. | Bicchi, Binello, et al., 1999 | 25. m/0.32 mm/0.25 μm, Hydrogen, 50. C @ 1. min, 3. K/min, 220. C @ 10. min |
Capillary | CW 20M | 1807. | Bicchi, Binello, et al., 1999 | 25. m/0.32 mm/0.25 μm, Hydrogen, 50. C @ 1. min, 3. K/min, 220. C @ 10. min |
Capillary | CW 20M | 1807. | Bicchi, Binello, et al., 1999 | 25. m/0.32 mm/0.25 μm, Hydrogen, 50. C @ 1. min, 3. K/min, 220. C @ 10. min |
Capillary | CW 20M | 1809. | Bicchi, Binello, et al., 1999 | 25. m/0.32 mm/0.25 μm, Hydrogen, 50. C @ 1. min, 3. K/min, 220. C @ 10. min |
Capillary | HP Innowax FSP | 1845. | Kaya, Baser, et al., 1999 | 60. m/0.25 mm/0.25 μm, He, 60. C @ 10. min, 220. C @ 10. min |
Capillary | Carbowax | 1809. | Menon, Chacko, et al., 1999 | N2, 1. K/min, 200. C @ 20. min; Column length: 50. m; Column diameter: 0.2 mm; Tstart: 80. C |
Capillary | Supelcowax-10 | 1829. | Lamarque, Maestri, et al., 1998 | He, 4. K/min; Column length: 30. m; Column diameter: 0.25 mm; Tstart: 60. C; Tend: 240. C |
Capillary | DB-Wax | 1810. | Sagrero-Nieves and Bartley, 1996 | 60. m/0.32 mm/0.50 μm, He, 50. C @ 1. min, 8. K/min, 250. C @ 6. min |
Capillary | TC-Wax | 1839. | Shuichi, Masazumi, et al., 1996 | 80. C @ 5. min, 3. K/min; Column length: 60. m; Column diameter: 0.25 mm; Tend: 240. C |
Capillary | DB-Wax | 1808. | Stashenko, Torres, et al., 1995 | 60. m/0.25 mm/0.25 μm, He, 50. C @ 5. min, 2.5 K/min; Tend: 180. C |
Capillary | Carbowax 20M | 1809. | Egolf and Jurs, 1993 | 2. K/min; Column length: 80. m; Column diameter: 0.2 mm; Tstart: 70. C; Tend: 170. C |
Capillary | DB-Wax | 1845. | Wyllie, Brophy, et al., 1990 | 70. C @ 2. min, 4. K/min; Column length: 30. m; Column diameter: 0.32 mm; Tend: 200. C |
Packed | Carbowax 20M | 1835. | Stancher and Pertoldi, 1967 | Hydrogen, Gas-Chrom Z (80-100 mesh), 4. K/min; Column length: 2. m; Tstart: 65. C; Tend: 220. C |

Normal alkane RI, polar column, custom temperature program

Column type | Active phase | I | Reference | Comment |
---|---|---|---|---|
Capillary | Supelco CO Wax-10 | 1842. | Prompona, Kandylis, et al., 2012 | 60. m/0.32 mm/0.25 μm, Helium; Program: 35 0C (6 min) 2 0C/min -> 60 0C (5 min) 5 0C/min -> 200 0C 25 0C/min -> 250 0C (6 min) |
Capillary | Supelco CO Wax-10 | 1827. | Prompona, Kandylis, et al., 2012 | 60. m/0.32 mm/0.25 μm, Helium; Program: not specified |
Capillary | Supelco CO Wax-10 | 1843. | Prompona, Kandylis, et al., 2012 | 60. m/0.32 mm/0.25 μm, Helium; Program: not specified |
Capillary | HP-Innowax | 1847. | Xiao, Dai, et al., 2011 | 60. m/0.25 mm/0.25 μm, Helium; Program: 40 0C (2 min) 3 0C/min -> 150 0C 5 0C/min -> 220 0C (5 min) |
Capillary | DB-FFAP | 1803. | Mebazaa, Mahmoudi, et al., 2009 | 30. m/0.25 mm/0.25 μm, Helium; Program: 50 0C 2 0C/min -> 100 0C (5 min) 5 0C/min -> 250 0C |
Capillary | DB-FFAP | 1808. | Mebazaa, Mahmoudi, et al., 2009 | 30. m/0.25 mm/0.25 μm, Helium; Program: not specified |
Capillary | SOLGel-Wax | 1824. | Shu and Shen, 2008 | 30. m/0.53 mm/0.50 μm, Helium; Program: 40 0C 7 0C/min -> 180 0C 10 0C/min -> 240 0C (10 min) |
Capillary | SOLGel-Wax | 1824. | Shu and Shen, 2008 | 30. m/0.53 mm/0.50 μm, Helium; Program: not specified |
Capillary | HP-20M | 1827. | Chaieb, Hajlaoui, et al., 2007 | Program: not specified |
Capillary | HP-Innowax FSC | 1845. | Tabanca N., Demirci B., et al., 2007 | 60. m/0.25 mm/0.25 μm, He; Program: 60C(10min) => 4C/min => 220C(10min) => 1C/min => 240C |
Capillary | HP-Innowax FSC | 1845. | Tabanca, Demirci, et al., 2006 | 60. m/0.25 mm/0.25 μm; Program: 60C(10min) => 4C/min => 220C (10min) => 1C/min => 240C |
Capillary | HP-Innowax FSC | 1845. | Tabanca, Demirci, et al., 2005 | 60. m/0.25 mm/0.25 μm, He; Program: 60C(10min) => 4C/min => 220C(10min) => 1C/min => 240C |
Capillary | Carbowax 20M | 1809. | Vinogradov, 2004 | Program: not specified |
Capillary | Innowax FSC | 1844. | Tabanca N., Demirci F., et al., 2001 | 60. m/0.25 mm/0.25 μm, He; Program: 60C(10min) => 4C/min => 220C(10min) => 1C/min => 240C |
Capillary | Polyethylene Glycol | 1822. | Grundschober, 1991 | Program: not specified |
Capillary | Carbowax 20M | 1809. | Shibamoto, 1987 | Program: not specified |

References

Aldrich Chemical Company Inc., 1990
Aldrich Chemical Company Inc.,
Catalog Handbook of Fine Chemicals, Aldrich Chemical Company, Inc., Milwaukee WI, 1990, 1. [all data]
Lecat, 1947
Lecat, M.,
Some azeotropes of which one constituant is heterocyclic nitrogen,
Ann. Soc. Sci. Bruxelles, Ser. 1, 1947, 61, 73. [all data]
Perkin, 1896
Perkin, W.H.,
LXIX. On Magnetic Rotatory Power, especially of Aromatic Compounds,
J. Chem. Soc., 1896, 69, 1025-1257. [all data]
Stephenson and Malanowski, 1987
Stephenson, Richard M.; Malanowski, Stanislaw,
Handbook of the Thermodynamics of Organic Compounds, 1987, https://doi.org/10.1007/978-94-009-3173-2
. [all data]
Tudor, 1997
Tudor, E.,
Temperature dependence of the retention index for perfumery compounds on a SE-30 glass capillary column. I. Linear equations,
J. Chromatogr. A, 1997, 779, 1-2, 287-297, https://doi.org/10.1016/S0021-9673(97)00453-6
. [all data]
Tepe, Askin Akpulat, et al., 2006
Tepe, B.; Askin Akpulat, H.; Sokmen, M.; Daferera, D.; Yumrutas, O.; Aydin, E.; Polissiou, M.; Sokmen, A.,
Screening of the antioxidative and antimicrobial properties of the essential oils of Pimpinella anisetum and Pimpinella flabellifolia from Turkey,
Food Chem., 2006, 97, 4, 719-724, https://doi.org/10.1016/j.foodchem.2005.05.045
. [all data]
Thangadurai, Anitha, et al., 2002
Thangadurai, D.; Anitha, S.; Pullaiah, T.; Reddy, P.N.; Ramachandraiah, O.S.,
Essential oil constituents and in vitro antimicrobial activity of Decalepis hamiltonii roots against foodborne pathogens,
J. Agric. Food Chem., 2002, 50, 11, 3147-3149, https://doi.org/10.1021/jf011541q
. [all data]
Gudzic, Dordevic, et al., 2001
Gudzic, B.; Dordevic, S.; Palic, R.; Stojanovic, G.,
Essential oils of Hypericum olympicum L. and Hypericum perforatum L.,
Flavour Fragr. J., 2001, 16, 3, 201-203, https://doi.org/10.1002/ffj.978
. [all data]
Adams, 2000
Adams, R.P.,
Systematics of Juniperus section Juniperus based on leaf essential oils and random amplified polymorphic DNAs (RAPDs),
Biochem. Syst. Ecol., 2000, 28, 6, 515-528, https://doi.org/10.1016/S0305-1978(99)00089-7
. [all data]
Adams, 1999
Adams, R.P.,
Systematics of multi-seeded eastern hemisphere Juniperus based on leaf essential oils and RAPD DNA fingerprinting,
Biochem. Syst. Ecol., 1999, 27, 7, 709-725, https://doi.org/10.1016/S0305-1978(99)00016-2
. [all data]
Senatore and de Feo, 1999
Senatore, F.; de Feo, V.,
Chemical composition of the essential oil from Tagetes mandonii Sch. Bip. (Asteraceae),
Flavour Fragr. J., 1999, 14, 1, 32-34, https://doi.org/10.1002/(SICI)1099-1026(199901/02)14:1<32::AID-FFJ772>3.0.CO;2-7
. [all data]
Riu-Aumatell, Castellari, et al., 2004
Riu-Aumatell, M.; Castellari, M.; López-Tamames, E.; Galassi, S.; Buxaderas, S.,
Characterisation of volatile compounds of fruit juices and nectars by HS/SPME and GC/MS,
Food Chem., 2004, 87, 4, 627-637, https://doi.org/10.1016/j.foodchem.2003.12.033
. [all data]
Adams, 1998
Adams, R.P.,
The essential oils and chemotaxonomy of Juniperus sect. Juniperus,
Biochem. Syst. Ecol., 1998, 26, 6, 637-645, https://doi.org/10.1016/S0305-1978(98)00020-9
. [all data]
Ramsey, Lee, et al., 1980
Ramsey, J.D.; Lee, T.D.; Osselton, M.D.; Moffat, A.C.,
Gas-liquid chromatographic retention indices of 296 non-drug substances on SE-30 or OV-1 likely to be encountered in toxicological analyses,
J. Chromatogr., 1980, 184, 2, 185-206, https://doi.org/10.1016/S0021-9673(00)85641-1
. [all data]
Tudor, Moldovan, et al., 1999
Tudor, E.; Moldovan, D.; Zârna, N.,
Temperature dependence of the retention index for perfumery compounds on two carbowax-20M glass capillary columns with different film thickness. 2,
Rev. Roum. Chim., 1999, 44, 7, 665-675. [all data]
Wong and Teng, 1994
Wong, K.C.; Teng, Y.E.,
Volatile Components of Mimusops elengi L. Flowers,
J. Essent. Oil Res., 1994, 6, 5, 453-458, https://doi.org/10.1080/10412905.1994.9698425
. [all data]
Benkaci-Ali, Baaliouamer, et al., 2007
Benkaci-Ali, F.; Baaliouamer, A.; Meklati, B.Y.; Chemat, F.,
Chemical composition of seed essential oils from Algerian Nigella sativa extracted by microwave and hydrodistillation,
Flavour Fragr. J., 2007, 22, 2, 148-153, https://doi.org/10.1002/ffj.1773
. [all data]
Sonboli, Azizian, et al., 2007
Sonboli, A.; Azizian, D.; Yousefzadi, M.; Kanani, M.R.; Mehrabian, A.R.,
Volatile constituents and antimicrobial activity of the essential oil of Tetrataenium lasiopetalum (Apiaceae) from Iran,
Flavour Fragr. J., 2007, 22, 2, 119-122, https://doi.org/10.1002/ffj.1767
. [all data]
Andrianoelisoa H.S., Menut C., et al., 2006
Andrianoelisoa H.S.; Menut C.; de Chatelperron P.C.; Saracco J.; Ramanoelina P.; Danthu P.,
Intraspecific chemical variability and highlighting of chemotypes of leaf essential oils from Ravensara aromatica Sonnerat a tree endemic to Madagascar,
Flavour Fragr. J., 2006, 21, 5, 833-838, https://doi.org/10.1002/ffj.1735
. [all data]
Zeller and Rychlik, 2006
Zeller, A.; Rychlik, M.,
Character impact odorants of fennel fruits and fennel tea,
J. Agric. Food Chem., 2006, 54, 10, 3686-3692, https://doi.org/10.1021/jf052944j
. [all data]
Ziegenbein, Hanssen, et al., 2006
Ziegenbein, F.C.; Hanssen, H.-P.; König, W.A.,
Secondary metabolites from Ganoderma lucidum and Spongiporus leucomallellus,
Phytochemistry, 2006, 67, 2, 202-211, https://doi.org/10.1016/j.phytochem.2005.10.025
. [all data]
de Feo, Urrunaga Soria, et al., 2005
de Feo, V.; Urrunaga Soria, E.; Urrunaga Soria, R.; Pizza, C.,
Composition and in vitro toxicity of the essential oil of Tagetes terniflora HBK. (Asteraceae),
Flavour Fragr. J., 2005, 20, 1, 89-92, https://doi.org/10.1002/ffj.1379
. [all data]
Flamini, Luigi Cioni, et al., 2005
Flamini, G.; Luigi Cioni, P.; Morelli, I.,
Composition of the essential oils and in vivo emission of volatiles of four Lamium species from Italy: L. purpureum, L. hybridum, L. bifidum and L. amplexicaule,
Food Chem., 2005, 91, 1, 63-68, https://doi.org/10.1016/j.foodchem.2004.05.047
. [all data]
Pino, Mesa, et al., 2005
Pino, J.A.; Mesa, J.; Muñoz, Y.; Martí, M.P.; Marbot, R.,
Volatile components from mango (Mangifera indica L.) cultivars,
J. Agric. Food Chem., 2005, 53, 6, 2213-2223, https://doi.org/10.1021/jf0402633
. [all data]
Antunes, Sevinate-Pinto, et al., 2004
Antunes, T.; Sevinate-Pinto, I.; Barroso, J.G.; Cavaleiro, C.; Salgueiro, L.R.,
Micromorphology of trichomes and composition of essential oil of Teucrium capitatum,
Flavour Fragr. J., 2004, 19, 4, 336-340, https://doi.org/10.1002/ffj.1310
. [all data]
Bertoli, Menichini, et al., 2004
Bertoli, A.; Menichini, F.; Noccioli, C.; Morelli, I.; Pistelli, L.,
Volatile constituents of different organs of Psoralea bituminosa L.,
Flavour Fragr. J., 2004, 19, 2, 166-171, https://doi.org/10.1002/ffj.1315
. [all data]
Garland, Menary, et al., 2004
Garland, S.M.; Menary, R.C.; Davies, N.W.; Oliver, G.S.,
Practical approaches to the analyses for pesticide residues in essential oils, A report for the Rural Industries Research and Development Corporation, RIRDC Publication No. 04/109, Rural Industries Research and Development Corporation, Barton, ACT, 2004. [all data]
Gonny, Bradesi, et al., 2004
Gonny, M.; Bradesi, P.; Casanova, J.,
Identification of the components of the essential oil from wild Corsican Daucus carota L. using 13C-NMR spectroscopy,
Flavour Fragr. J., 2004, 19, 5, 424-433, https://doi.org/10.1002/ffj.1330
. [all data]
Javidnia, Miri, et al., 2004
Javidnia, K.; Miri, R.; Jafari, A.; Rezai, H.,
Analysis of the volatile constituents of Nepeta macrosiphon Boiss. grown in Iran,
Flavour Fragr. J., 2004, 19, 2, 156-158, https://doi.org/10.1002/ffj.1287
. [all data]
Javidnia, Miri, et al., 2004, 2
Javidnia, K.; Miri, R.; Kamalinejad, M.; Sarkarzadeh, H.; Jamalian, A.,
Chemical composition of the essential oils of Anthemis altissima L. grown in Iran,
Flavour Fragr. J., 2004, 19, 3, 213-216, https://doi.org/10.1002/ffj.1277
. [all data]
Pino, Marbot, et al., 2004
Pino, J.A.; Marbot, R.; Vazquez, C.,
Volatile components of tamarind (Tamarindus indica L.) grown in Cuba,
J. Essent. Oil Res., 2004, 16, 4, 318-320, https://doi.org/10.1080/10412905.2004.9698731
. [all data]
Pino, Marbot, et al., 2004, 2
Pino, J.A.; Marbot, R.; Rosado, A.; Vázquez, C.,
Volatile constituents of Malay rose apple [Syzygium malaccense (L.) Merr. Perry],
Flavour Fragr. J., 2004, 19, 1, 32-35, https://doi.org/10.1002/ffj.1269
. [all data]
Bicchi, Rubiolo, et al., 2003
Bicchi, C.; Rubiolo, P.; Camargo, E.E.S.; Vilegas, W.; Gracioso, J.S.; Brito, A.R.M.S.,
Components of Turnera diffusa Willd. var. afrodisiaca (Ward) Urb. essential oil,
Flavour Fragr. J., 2003, 18, 1, 59-61, https://doi.org/10.1002/ffj.1155
. [all data]
Boyom, Assembe, et al., 2003
Boyom, F.F.; Assembe, E.Z.; Zollo, P.H.A.; Agnaniet, H.; Menut, C.; Bessière, J.M.,
Aromatic plants of tropical central Africa. Part XLII. Volatile components from Antidesma laciniatum Muell. Arg. Var. laciniatum growing in Cameroon,
Flavour Fragr. J., 2003, 18, 5, 451-453, https://doi.org/10.1002/ffj.1251
. [all data]
Pino, Marbot, et al., 2003
Pino, J.; Marbot, R.; Rosado, A.; Vázquez, C.,
Volatile constituents of fruits of Garcinia dulcis Kurz. from Cuba,
Flavour Fragr. J., 2003, 18, 4, 271-274, https://doi.org/10.1002/ffj.1187
. [all data]
Sun and Stremple, 2003
Sun, G.; Stremple, P.,
Retention index characterization of flavor, fragrance, and many other compounds on DB-1 and DB-XLB, 2003, retrieved from http://www.chem.agilent.com/cag/cabu/pdf/b-0279.pdf. [all data]
Javidnia, Miri, et al., 2002
Javidnia, K.; Miri, R.; Kamalinejad, M.; Nasiri, A.,
Composition of the essential oil of Salvia mirzayanii Rech. f. Esfand from Iran,
Flavour Fragr. J., 2002, 17, 6, 465-467, https://doi.org/10.1002/ffj.1128
. [all data]
Pino, Marbot, et al., 2002
Pino, J.; Marbot, R.; Rosado, A.,
Volatile constituents of star apple (Chrysophyllum cainito L.) from Cuba,
Flavour Fragr. J., 2002, 17, 5, 401-403, https://doi.org/10.1002/ffj.1116
. [all data]
Aligiannis, Kalpoutzakis, et al., 2001
Aligiannis, N.; Kalpoutzakis, E.; Chinou, I.B.; Mitaku, S.; Gikas, E.; Tsarbopoulos, A.,
Composition and antimicrobial activity of the essential oils of five taxa of Sideritis from Greece,
J. Agric. Food Chem., 2001, 49, 2, 811-815, https://doi.org/10.1021/jf001018w
. [all data]
Hudaib, Grazia Bellardi, et al., 2001
Hudaib, M.; Grazia Bellardi, M.; Rubies-Autonell, C.; Fiori, J.; Cavrini, V.,
Chromatographic (GC-MS, HPLC) and virological evaluations of Salvia sclarea infected by BBWV-I,
Farmaco, 2001, 56, 3, 219-227, https://doi.org/10.1016/S0014-827X(01)01038-2
. [all data]
Mirza and Sefidkon, 1999
Mirza, M.; Sefidkon, F.,
Essential oil composition of two Salvia species from Iran, Salvia nemorosa L. and Salvia reuterana Boiss.,
Flavour Fragr. J., 1999, 14, 4, 230-232, https://doi.org/10.1002/(SICI)1099-1026(199907/08)14:4<230::AID-FFJ816>3.0.CO;2-L
. [all data]
Bicchi, Fresia, et al., 1997
Bicchi, C.; Fresia, M.; Rubiolo, P.; Monti, D.; Franz, C.; Goehler, I.,
Constituents of Tagetes lucida Cav. ssp. lucida essential oil,
Flavour Fragr. J., 1997, 12, 1, 47-52, https://doi.org/10.1002/(SICI)1099-1026(199701)12:1<47::AID-FFJ610>3.0.CO;2-7
. [all data]
Stashenko, Prada, et al., 1996
Stashenko, E.E.; Prada, N.Q.; Martínez, J.R.,
HRGC/FID/NP and HRGC/MSD study of Colombian Ylang-Ylang (Cananga odorata) oils obtained by different extraction techniques,
J. Hi. Res. Chromatogr., 1996, 19, 6, 353-358, https://doi.org/10.1002/jhrc.1240190609
. [all data]
Stashenko, Martinez, et al., 1995
Stashenko, E.E.; Martinez, C.R.; Martinez, J.R.; Shibamoto, T.,
Catalytic transformation of anise (Pimpinella anisum L.) oil over zeolite Y,
J. Hi. Res. Chromatogr., 1995, 18, 8, 501-503, https://doi.org/10.1002/jhrc.1240180810
. [all data]
Pérez, Navarro, et al., 2007
Pérez, R.A.; Navarro, T.; de Lorenzo, C.,
HS-SPME analysis of the volatile compounds from spices as a source of flavour in 'Campo Real' table olive preparations,
Flavour Fragr. J., 2007, 22, 4, 265-273, https://doi.org/10.1002/ffj.1791
. [all data]
Cardeal, da Silva, et al., 2006
Cardeal, Z.L.; da Silva, M.D.R.G.; Marriott, P.J.,
Comprehensive two-dimensional gas chromatography/mass spectrometric analysis of pepper volatiles,
Rapid Commun. Mass Spectrom., 2006, 20, 19, 2823-2836, https://doi.org/10.1002/rcm.2665
. [all data]
Guerrini, Sacchetti, et al., 2006
Guerrini, A.; Sacchetti, G.; Muzzoli, M.; Rueda, G.M.; Medici, A.; Besco, E.; Bruni, R.,
Composition of the Volatile Fraction of Ocotea bofo Kunth (Lauraceae) Calyces by GC-MS and NMR Fingerprinting and Its Antimicrobial and Antioxidant Activity,
J. Agric. Food Chem., 2006, 54, 20, 7778-7788, https://doi.org/10.1021/jf0605493
. [all data]
Moon, Cliff, et al., 2006
Moon, S.-Y.; Cliff, M.A.; Li-Chan, E.C.Y.,
Odour-active components of simulated beef flavour analysed by solid phase microextraction and gas chromatography-mass spectrometry and -olfactometry,
Food Res. Int., 2006, 39, 3, 294-308, https://doi.org/10.1016/j.foodres.2005.08.002
. [all data]
Sacchetti, Guerrini, et al., 2006
Sacchetti, G.; Guerrini, A.; Noriega, P.; Bianchi, A.; Bruni, R.,
Essential oil of wild Ocotea quixos (Lam.) Kosterm. (Lauraceae) leaves from Amazonian Ecuador,
Flavour Fragr. J., 2006, 21, 4, 674-676, https://doi.org/10.1002/ffj.1648
. [all data]
Fuhrmann and Grosch, 2002
Fuhrmann, E.; Grosch, W.,
Character impact odorants of the apple cultivars Elstar and Cox Orange,
Nahrung/Food, 2002, 46, 3, 187-193, https://doi.org/10.1002/1521-3803(20020501)46:3<187::AID-FOOD187>3.0.CO;2-5
. [all data]
García, Alvarez, et al., 2002
García, D.; Alvarez, A.; Tornos, P.; Fernandez, A.; Sáenz, T.,
Gas chromatographic-mass spectrometry study of the essential oils of Pimenta racemosa var. terebinthina and P. racemosa var. grisea,
Z. Naturforsch., 2002, 57c, 449-451. [all data]
Loayza, de Groot, et al., 1999
Loayza, I.; de Groot, W.; Lorenzo, D.; Dellacassa, E.; Mondello, L.; Dugo, G.,
Composition of the essential oil of Porophyllum ruderale (Jacq.) Cass. from Bolivia,
Flavour Fragr. J., 1999, 14, 6, 393-398, https://doi.org/10.1002/(SICI)1099-1026(199911/12)14:6<393::AID-FFJ849>3.0.CO;2-5
. [all data]
Mondello, Dugo, et al., 1995
Mondello, L.; Dugo, P.; Basile, A.; Dugo, G.,
Interactive use of linear retention indices, on polar and apolar columns, with a MS-library for reliable identification of complex mixtures,
J. Microcolumn Sep., 1995, 7, 6, 581-591, https://doi.org/10.1002/mcs.1220070605
. [all data]
Chung, Yung, et al., 2002
Chung, H.-Y.; Yung, I.K.S.; Ma, W.C.J.; Kim, J.-S.,
Analysis of volatile components in frozen and dried scallops (Patinopecten yessoensis) by gas chromatography/mass spectrometry,
Food Res. Int., 2002, 35, 1, 43-53, https://doi.org/10.1016/S0963-9969(01)00107-7
. [all data]
Chung, 2000
Chung, H.Y.,
Volatile flavor components in red fermented soybean (Glycine max) curds,
J. Agric. Food Chem., 2000, 48, 5, 1803-1809, https://doi.org/10.1021/jf991272s
. [all data]
Chen and Ho, 1988
Chen, C.-C.; Ho, C.-T.,
Gas chromatographic analysis of volatile components of ginger oil (Zingiber officinale Roscoe) extracted with liquid carbon dioxide,
J. Agric. Food Chem., 1988, 36, 2, 322-328, https://doi.org/10.1021/jf00080a020
. [all data]
Cui, Yang, et al., 2011
Cui, J.; Yang, X.; Dong, A.-J.; Cheng, D.-Y.; Wang, J.; Zhao, H.-T.; Xu, R.-B.; Wang, P.; Li, W.-J.,
Chemical composition and antioxidant activity of Wuphorbia fischeriana essential oil from China,
J. Med. Plants Res., 2011, 5, 19, 4894-4798. [all data]
Vazquez, Demmel, et al., 2011
Vazquez, A.M.; Demmel, G.I.; Criado, S.G.; Aimar, M.L.; Cantero, J.; Rossi, L.I.; Velasco, M.I.,
Phytochemistry of TAgetes minuta L. (Asteraceae) from Cordoba, Argentina: comparative study between essential oil and HS-SPME analyses,
Boletin Latinoamericano y del Caribe Plantas Medicinales y Aromaticas, 2011, 10, 4, 351-362. [all data]
Dib, Djabou, et al., 2010
Dib, M.ElA.; Djabou, N.; Desjobert, L.-M.; Allali, H.; Tabti, B.; Muselli, A.; Costa, J.,
Characterization of volatile compounds of Daucus crinitus Desf. headspace solid phase microextraction as alternative technique to hydrodistillation,
Chem, Centr. J., 2010, 4, 16, 1-15. [all data]
Radulovic, Blagojevic, et al., 2010
Radulovic, N.; Blagojevic, P.; Palic, R.,
Comparative study of the leaf volatiles of Arctostaphylos uva-ursi (L.) Spreng. and Vaccinium vitis-idaea L. (Ericaceae),
Molecules, 2010, 15, 9, 6168-6185, https://doi.org/10.3390/molecules15096168
. [all data]
Scrivanti, Anton, et al., 2009
Scrivanti, L.R.; Anton, A.M.; Zygadlo, J.A.,
Essential oil conposition of Bothriochloa Kuntze (Poaceae) from South America and their chemotaxonomy,
Biochem. Systematics Ecol., 2009, 37, 3, 206-213, https://doi.org/10.1016/j.bse.2009.03.009
. [all data]
Araque, Rojas, et al., 2007
Araque, M.; Rojas, L.B.; Usubillaga, A.,
Antibacterial activity of essential oil of Foeniculum vulgare miller againts multiresistant gram-negative bacilli from nosocomial infections,
Ciencia, 2007, 15, 3, 366-370. [all data]
Marongiu B., Piras A., et al., 2007
Marongiu B.; Piras A.; Porcedda S.; Tuveri E.; Sanjust E.; Meli M.; Sollai F.; Zucca P.; Rescigno A.,
Supercritical CO2 extract of Cinnamomum zeylanicum: Chemical characterization and antityrosinase activity,
J. Agric. Food Chem., 2007, 55, 24, 10022-10027, https://doi.org/10.1021/jf071938f
. [all data]
Salehi, Asghari, et al., 2007
Salehi, P.; Asghari, B.; Mohammadi, F.,
Hydrodistillation-Headspace Solvent Microextraction: An Efficient Method for Analysis of the Essential Oil from the Seeds of Foeniculum vulgare Mill.,
Chromatographia, 2007, 65, 1-2, 119-122, https://doi.org/10.1365/s10337-006-0102-9
. [all data]
Smelcerovic, Spiteller, et al., 2007
Smelcerovic, A.; Spiteller, M.; Ligon, A.P.; Smelcerovic, Z.; Raabe, N.,
Essential oil composition of Hypericum L. species from Southeastern Serbia and their chemotaxonomy,
Biochem. Syst. Ecol., 2007, 35, 2, 99-113, https://doi.org/10.1016/j.bse.2006.09.012
. [all data]
Zeller and Rychlik, 2007
Zeller, A.; Rychlik, M.,
Impact of estragole and other odorants on the flavour of anise and tarragon,
Flavour Fragr. J., 2007, 22, 2, 105-113, https://doi.org/10.1002/ffj.1765
. [all data]
Miyazawa and Kawata, 2006
Miyazawa, M.; Kawata, J.,
Identification of the Key Aroma Compounds in Dried Roots of Rubia cordifolia,
L. Oleo Sci., 2006, 55, 1, 37-39, https://doi.org/10.5650/jos.55.37
. [all data]
Orav, Raal, et al., 2006
Orav, A.; Raal, A.; Arak, E.; Müürisepp, M.; Kailas, T.,
Composition of the essential oil of Artemisia absinthium L. of different geographical origin,
Proc. Est. Acad. Sci. Chem., 2006, 55, 3, 155-165. [all data]
Ozcan, Chalchat, et al., 2006
Ozcan, M.M.; Chalchat, J.-C.; Arslan, D.; Ates, A.; Unver, A.,
Comparative Essential Oil Composition and Antifungal Effect of Bitter Fennel (Foeniculum vulgare ssp. piperitum) Fruit Oils Obtained During Different Vegetation,
J. Medicinal Food, 2006, 9, 4, 552-561, https://doi.org/10.1089/jmf.2006.9.552
. [all data]
Pino, Marquez, et al., 2006
Pino, J.A.; Marquez, E.; Marbot, R.,
Volatile constituents from tea of roselle (Hibiscus sabdariffa L.),
Rev. CENIC Ciencias Quimicas, 2006, 37, 3, 127-129. [all data]
Schlumpberger B.O., Clery R.A., et al., 2006
Schlumpberger B.O.; Clery R.A.; Barthlott W.,
A unique cactus with scented and possibly bat-dispersed fruits: Rhipsalis juengeri,
Plant Biology, 2006, 8, 2, 265-270, https://doi.org/10.1055/s-2005-873045
. [all data]
Bendimerad and Bendiab, 2005
Bendimerad, N.; Bendiab, S.A.T.,
Composition and antibacterial activity of Pseudocytisus integrifolius (Salisb.) essential oil from Algeria,
J. Agric. Food Chem., 2005, 53, 8, 2947-2952, https://doi.org/10.1021/jf047937u
. [all data]
Fakhari A.R., Sonboli A., et al., 2005
Fakhari A.R.; Sonboli A.; Heydari R.,
Composition of the essential oil of Rhabdosciadium strausii from Iran,
Chem. Nat. Compd. (Engl. Transl.), 2005, 41, 4, 413-414, https://doi.org/10.1007/s10600-005-0164-1
. [all data]
Jirovetz, Buchbauer, et al., 2005
Jirovetz, L.; Buchbauer, G.; Stoyanova, A.; Georgiev, E.V.; Damianova, S.T.,
Composition, quality control and antimicrobial activity of the essential oil of cumin (Cuminum cyminumL.) seeds from Bulgaria that had been stored for up to 36 years,
Int. J. Food Sci. Technol., 2005, 40, 3, 305-310, https://doi.org/10.1111/j.1365-2621.2004.00915.x
. [all data]
Khajeh, Yamini, et al., 2005
Khajeh, M.; Yamini, Y.; Bahramifar, N.; Sefidkon, F.; Reza Pirmoradei, M.,
Comparison of essential oils compositions of Ferula assa-foetida obtained by supercritical carbon dioxide extraction and hydrodistillation methods,
Food Chem., 2005, 91, 4, 639-644, https://doi.org/10.1016/j.foodchem.2004.06.033
. [all data]
Leffingwell and Alford, 2005
Leffingwell, J.C.; Alford, E.D.,
Volatile constituents of Perique tobacco,
Electron. J. Environ. Agric. Food Chem., 2005, 4, 2, 899-915. [all data]
Pala-Paul, Perez-Alonso, et al., 2005
Pala-Paul, J.; Perez-Alonso, M.J.; Velasco-Negueruela, A.; Vadare, J.; Villa, A.M.; Sanz, J.; Brophy, J.J.,
Essential oil composition of the different parts of Eryngium bourgatii Gouan from Spain,
J. Chromatogr. A, 2005, 1074, 1-2, 235-239, https://doi.org/10.1016/j.chroma.2005.03.036
. [all data]
Sonboli A., Fakhari A.R., et al., 2005
Sonboli A.; Fakhari A.R.; Sefidkon F.,
Chemical composition of the essential oil of Salvia macilenta from Iran,
Chem. Nat. Compd. (Engl. Transl.), 2005, 41, 2, 168-170, https://doi.org/10.1007/s10600-005-0104-0
. [all data]
Srivastava, Srivastava, et al., 2005
Srivastava, A.K.; Srivastava, S.K.; Syamsundar, K.V.,
Bud and leaf essential oil composition of Syzygium aromaticum from India and Madagascar,
Flavour Fragr. J., 2005, 20, 1, 51-53, https://doi.org/10.1002/ffj.1364
. [all data]
JAvidnia, Mojab, et al., 2004
JAvidnia, K.; Mojab, F.; Mojahedi, S.A.,
Chemical constituents of the essential oil of Stachys lavandulifolia Vahl from Iran,
Iranian J. Pharm. Res., 2004, 3, 61-63. [all data]
Malencic, Couladis, et al., 2004
Malencic, Dj.; Couladis, M.; Mimica-Dukic, N.; Popovic, M.; Boza, P.,
Essential oils of three Salvia species from the Pannonian part of Serbia,
Flavour Fragr. J., 2004, 19, 3, 225-228, https://doi.org/10.1002/ffj.1291
. [all data]
Miyazawa, Fuhita, et al., 2004
Miyazawa, M.; Fuhita, T.; Yamafuji, C.; Matsui, M.; Kasahara, N.; Takagi, Y.; Ishikawa, Y.,
Chemical composition of volatile oil from the roots of Periploca sepium,
J. Oleo Sci., 2004, 53, 10, 511-513, https://doi.org/10.5650/jos.53.511
. [all data]
Miyazawa, Fujita, et al., 2004
Miyazawa, M.; Fujita, T.; Yamafuji, C.; Matsui, M.; Kasahara, N.; Takagi, Y.; Ishikawa, Y.,
Chemical composition of volatile oil from the roots of Periploca sepium,
J. Oleo Sci., 2004, 53, 11, 511-513, https://doi.org/10.5650/jos.53.511
. [all data]
Park, Lee, et al., 2004
Park, B.-S.; Lee, K.-G.; Takeoka, G.R.,
Comparison of three sample preparation methods on the recovery of volatiles from taheebo (Tabebuia impetiginosa Martius ex DC),
Flavour Fragr. J., 2004, 19, 4, 287-292, https://doi.org/10.1002/ffj.1345
. [all data]
Tellez, Khan, et al., 2004
Tellez, M.R.; Khan, I.A.; Schaneberg, B.T.; Crockett, S.L.; Rimando, A.M.; Kobaisy, M.,
Steam distillation-solid-phase microextraction for the detection of Ephedra sinica in herbal preparations,
J. Chromatogr. A, 2004, 1025, 1, 51-56, https://doi.org/10.1016/S0021-9673(03)01035-5
. [all data]
Wang, Guo, et al., 2004
Wang, H.; Guo, Y.; Zhang, Z.; An, D.,
Fast analysis of volatile compounds in natural essences by automatic Static-Headspace-GC-MS,
J. Instrum. Anal. (Chinese), 2004, 23, 1, 9-13. [all data]
Fekam Boyom, Ngouana, et al., 2003
Fekam Boyom, F.; Ngouana, V.; Amvam Zollo, P.H.; Menut, C.; Bessiere, J.M.; Gut, J.; Rosenthal, P.J.,
Composition and anti-plasmodial activities of essential oils from some Cameroonian medicinal plants,
Phytochemistry, 2003, 64, 7, 1269-1275, https://doi.org/10.1016/j.phytochem.2003.08.004
. [all data]
Pino, Marbot, et al., 2003, 2
Pino, J.A.; Marbot, R.; Fuentes, V.,
Characterization of volatiles in Bullock's heart (Annona reticulata L.) fruit cultivars from Cuba,
J. Agric. Food Chem., 2003, 51, 13, 3836-3839, https://doi.org/10.1021/jf020733y
. [all data]
Raal, Arak, et al., 2003
Raal, A.; Arak, E.; Orav, A.; Ivask, K.,
Comparison of essential oil content of Matricaria recutita L. from different origins,
Ars Pharm., 2003, 44, 2, 159-165, retrieved from http://www.ugr.es/~ars/abstract/44-159-03.pdf. [all data]
Gudzic, Djokovic, et al., 2002
Gudzic, B.; Djokovic, D.; Vajs, V.; Palic, R.; Stojanovic, G.,
Composition and antimicrobial activity of the essential oil of Hypericum maculatum Crantz,
Flavour Fragr. J., 2002, 17, 5, 392-394, https://doi.org/10.1002/ffj.1112
. [all data]
Iñigo, Palá-Paúl, et al., 2002
Iñigo, A.; Palá-Paúl, J.; Pérez-Alonso, M.J.; Velasco-Negueruela, A.,
Essential oil composition from the aerial parts of Haplophyllum linifolium (L.) G. Don fil.,
Botanica Complutensis, 2002, 26, 79-83. [all data]
Lockwood, Asghari, et al., 2002
Lockwood, G.B.; Asghari, G.; Hakimi, B.,
Production of essential oil constituents by cultured cells of Carum copticum L.,
Flavour Fragr. J., 2002, 17, 6, 456-458, https://doi.org/10.1002/ffj.1129
. [all data]
Mojab, Rustaiyan, et al., 2002
Mojab, F.; Rustaiyan, A.; Jasbi, A.R.,
Essential oils of Heracleum persicum Desf. ex Fischer leaves, 2002, retrieved from http://www1.tums.ac.ir/daru/DaruVolum10-No1-2002/Mojab.htm. [all data]
Pino, Marbot, et al., 2002, 2
Pino, J.A.; Marbot, R.; Vazquez, C.,
Characterization of volatiles in Loquat fruit (Eriobotrya japonica Lindl.),
Revista CENIC Ciencias Quimicas, 2002, 33, 3, 115-119. [all data]
Yamini, Sefidkon, et al., 2002
Yamini, Y.; Sefidkon, F.; Pourmortazavi, S.M.,
Comparison of essential oil composition of Iranian fennel (Foeniculum vulgare) obtained by supercritical carbon dioxide extraction and hydrodistillation methods,
Flavour Fragr. J., 2002, 17, 5, 345-348, https://doi.org/10.1002/ffj.1117
. [all data]
Brun, Bessière, et al., 2001
Brun, G.; Bessière, J.-M.; Dijoux-Franca, M.-G.; David, B.; Mariotte, A.-M.,
Volatile components of Catharanthus roseus (L.) G. Don (Apocynaceae),
Flavour Fragr. J., 2001, 16, 2, 116-119, https://doi.org/10.1002/ffj.958
. [all data]
Orav and Kann, 2001
Orav, A.; Kann, J.,
Determination of peppermint and orange aroma compounds in food and beverages,
Proc. Est. Acad. Sci. Chem., 2001, 50, 4, 217-225. [all data]
de Beck, Bessière, et al., 2000
de Beck, P.O.; Bessière, J.M.; Dijoux-Franca, M.-G.; David, B.; Mariotte, A.-M.,
Volatile constituents from leaves and wood of Leea guineensis G. Don (Leeaceae) from Cameroon,
Flavour Fragr. J., 2000, 15, 3, 182-185, https://doi.org/10.1002/1099-1026(200005/06)15:3<182::AID-FFJ888>3.0.CO;2-X
. [all data]
Fraternale, Giamperi, et al., 2000
Fraternale, D.; Giamperi, L.; Ricci, D.; Manunta, A.,
Composition of the essential oil of Peucedanum verticillare,
Biochem. Syst. Ecol., 2000, 28, 2, 143-147, https://doi.org/10.1016/S0305-1978(99)00049-6
. [all data]
Bicchi, Binello, et al., 1999
Bicchi, C.; Binello, A.; D'Amato, A.; Rubiolo, P.,
Reliability of Van den Dool retention indices in the analysis of essential oils,
J. Chromatogr. Sci., 1999, 37, 8, 288-294, https://doi.org/10.1093/chromsci/37.8.288
. [all data]
Menon, Chacko, et al., 1999
Menon, A.N.; Chacko, S.; Narayanan, C.S.,
Free and glycosidically bound volatiles of cardamom (Eletteria cardamomum Maton var. miniscula Burkill),
Flavour Fragr. J., 1999, 14, 1, 65-68, https://doi.org/10.1002/(SICI)1099-1026(199901/02)14:1<65::AID-FFJ789>3.0.CO;2-A
. [all data]
Lamarque, Maestri, et al., 1998
Lamarque, A.L.; Maestri, D.M.; Zygadlo, J.A.; Grosso, N.R.,
Volatile constituents from flowers of Acacia caven (Mol.) Mol. var. caven, Acacia aroma Gill. ex Hook., Erythrina crista-galli L. and Calliandra tweedii Benth.,
Flavour Fragr. J., 1998, 13, 4, 266-268, https://doi.org/10.1002/(SICI)1099-1026(1998070)13:4<266::AID-FFJ739>3.0.CO;2-5
. [all data]
Bos, Woerdenbag, et al., 1997
Bos, R.; Woerdenbag, H.J.; Hendriks, H.; Smit, H.F.; Wikström, H.V.; Scheffer, J.J.C.,
Composition of the essential oil from roots and rhizomes of Valeriana wallichii DC,
Flavour Fragr. J., 1997, 12, 2, 123-131, https://doi.org/10.1002/(SICI)1099-1026(199703)12:2<123::AID-FFJ613>3.0.CO;2-4
. [all data]
Sagrero-Nieves and Bartley, 1996
Sagrero-Nieves, L.; Bartley, J.P.,
Volatile components from the leaves of heterotheca inuloides Cass.,
Flavour Fragr. J., 1996, 11, 1, 49-51, https://doi.org/10.1002/(SICI)1099-1026(199601)11:1<49::AID-FFJ538>3.0.CO;2-J
. [all data]
Stashenko, Torres, et al., 1995
Stashenko, E.E.; Torres, W.; Morales, J.R.M.,
A study of the compositional variation of the essential oil of ylang-ylang (Cananga odorata Hook Fil. et Thomson, forma genuina) during flower development,
J. Hi. Res. Chromatogr., 1995, 18, 2, 101-104, https://doi.org/10.1002/jhrc.1240180206
. [all data]
Egolf and Jurs, 1993
Egolf, L.M.; Jurs, P.C.,
Quantitative structure-retention and structure-odor intensity relationships for a diverse group of odor-active compounds,
Anal. Chem., 1993, 65, 21, 3119-3126, https://doi.org/10.1021/ac00069a027
. [all data]
Tkachenko and Zenkevich, 1993
Tkachenko, K.G.; Zenkevich, I.G.,
Chemical Composition of the Leaf Oil of Myrrhis odorata (L.) Scop.,
J. Essent. Oil Res., 1993, 5, 3, 329-331, https://doi.org/10.1080/10412905.1993.9698232
. [all data]
Wyllie, Brophy, et al., 1990
Wyllie, S.G.; Brophy, J.J.; Sarafis, V.; Hobbs, M.,
Volatile Components of the Fruit of Pistacia Lentiscus,
J. Food. Sci., 1990, 55, 5, 1325-1326, https://doi.org/10.1111/j.1365-2621.1990.tb03926.x
. [all data]
Albano, Lima, et al., 2012
Albano, S.M.; Lima, A.S.; Miguel, M.G.; Pedro, L.G.; Barroso, J.G.; Figueiredo, A.C.,
Antioxidant, anti-5-lipoxygenase and antiacetylcholinesterase activities of essential oils and decoction water of some aromatic plants,
Rec. Nat. Prod., 2012, 6, 1, 35-48. [all data]
Mondello, 2012
Mondello, L.,
HS-SPME-GCxGC-MS analysis of Yerba Mate (Ilex paraguariensis)
in Shimadzu GC-GC application compendium of comprehensive 2D GC, Vol. 1-5, Shimadzu Corp., 2012, 1-29. [all data]
Mebazaa, Mahmoudi, et al., 2009
Mebazaa, R.; Mahmoudi, A.; Fouchet, M.; Dos Santos, M.; Kamissoko, F.; Nafti, A.; Ben Cheikh, R.; Rega, B.; Camel, V.,
Characterization of volatile compounds in Tunisian fenugreek seeds,
Food Chem., 2009, 115, 4, 1326-1336, https://doi.org/10.1016/j.foodchem.2009.01.066
. [all data]
Kannaste, Vongvanich, et al., 2008
Kannaste, A.; Vongvanich, N.; Borg-Karlson, A.-K.,
Infestation by a Nalepella species induces emissions of alpha- and beta-farnesenes, (-)-linalool and aromatic compounds in Norway spruce clones of different susceptibility to the large pine weevil,
Anthropod-Plant Interactions, 2008, 2, 1, 31-41, https://doi.org/10.1007/s11829-008-9029-4
. [all data]
Ning, Zheng, et al., 2008
Ning, H.; Zheng, F.; Sun, B.; Xie, J.; Liu, Y.,
Solvent-free microwave extraction of essential oil from Zanthoxylum bungeanum Maxim.,
Food Environ. Ind. (Chinese), 2008, 34, 5, 179-184. [all data]
Xie, Sun, et al., 2008
Xie, J.; Sun, B.; Zheng, F.; Wang, S.,
Volatile flavor constituents in roasted pork of mini-pig,
Food Chem., 2008, 109, 3, 506-514, https://doi.org/10.1016/j.foodchem.2007.12.074
. [all data]
Liu, Xu, et al., 2007
Liu, Y.; Xu, X.-L.; Zhou, G.-H.,
Comparative study of volatile compounds in traditional Chinese Nanjing marinated duck by different extraction techniques,
Int. J. Food Sci. Technol., 2007, 42, 5, 543-550, https://doi.org/10.1111/j.1365-2621.2006.01264.x
. [all data]
Polzin, Stanfill, et al., 2007
Polzin, G.M.; Stanfill, S.B.; Brown, C.R.; Ashley, D.L.; Watson, C.H.,
Determination of eugenol, anethole, and coumarin in the mainstream cigarette smoke of Indonesian clove cigarettes,
Food Chem. Toxicol., 2007, 45, 10, 1948-1953, https://doi.org/10.1016/j.fct.2007.04.012
. [all data]
Santos, Santiago, et al., 2007
Santos, H.S.; Santiago, G.M.P.; de Oliveira, J.P.P.; Arriaga, A.M.C.; Marques, D.D.; Lemos, T.L.G.,
Chemical composition and larvicidal activity against Aedes aegypti of essential oils from Croton zehntneri,
Natural Product Communications, 2007, 2, 12, 1233-1236. [all data]
Jordan, Martinez, et al., 2006
Jordan, M.J.; Martinez, R.M.; Goodner, K.L.; Baldwin, E.A.; Sotomayor, J.A.,
Seasonal variation of Thymus hyemalis Lange and Spanish Thymus vulgaris L. essential oils composition,
Ind. Crops Prod., 2006, 24, 3, 253-263, https://doi.org/10.1016/j.indcrop.2006.06.011
. [all data]
de Lima, Maia, et al., 2006
de Lima, M.G.A.; Maia, I.C.C.; de Sousa, M.D.; de Morais, S.M.; Freitas, S.M.,
Effect of stalk and leaf extracts from euphorbiaceae species on Aedes aegypti (Diptera, culicidae) larvae,
Rev. Inst. Med. trop. S. Paulo, 2006, 48, 4, 211-214, https://doi.org/10.1590/S0036-46652006000400007
. [all data]
Koutsoudaki, Krsek, et al., 2005
Koutsoudaki, C.; Krsek, M.; Rodger, A.,
Chemical composition and antibacterial activity of the essential oil and the gum of pistacia lentiscus Var. chia,
J. Agric. Food Chem., 2005, 53, 20, 7681-7685, https://doi.org/10.1021/jf050639s
. [all data]
Pino, Marbot, et al., 2005
Pino, J.A.; Marbot, R.; Rosado, A.; Vázquez, C.,
Volatile constituents of Malay rose apple [Syzygium malaccense (L.) Merr. Perry],
Flavour Fragr. J., 2005, 20, 98-100. [all data]
Lo Cantore, Iacobellis, et al., 2004
Lo Cantore, P.; Iacobellis, N.S.; de Marco, A.; Capasso, F.; Senatore, F.,
Antibacterial activity of Coriandrum sativum L. and Foeniculum vulgare Miller Var. vulgare (Miller) essential oils,
J. Agric. Food Chem., 2004, 52, 26, 7862-7866, https://doi.org/10.1021/jf0493122
. [all data]
Silva, Matos, et al., 2004
Silva, M.G. deV.; Matos, F.J. de.A.; Lopes, P.R.O.; Silva, F.O.; Holanda, M.T.,
Composition of Essential Oils from Three Ocimum Species Obtained by Steam and Microwave Distillation and Supercritical CO2 Extraction,
ARKIVOS, 2004, 6, 6, 66-71, https://doi.org/10.3998/ark.5550190.0005.609
. [all data]
Sotomayor, Martínez, et al., 2004
Sotomayor, J.A.; Martínez, R.M.; García, A.J.; Jordán, M.J.,
Thymus zygis Subsp. Gracilis: watering level effect on phytomass production and essential oil quality,
J. Agric. Food Chem., 2004, 52, 17, 5418-5424, https://doi.org/10.1021/jf0496245
. [all data]
Vinogradov, 2004
Vinogradov, B.A.,
Production, composition, properties and application of essential oils, 2004, retrieved from http://viness.narod.ru. [all data]
Güllüce, Sökmen, et al., 2003
Güllüce, M.; Sökmen, M.; Daferera, D.; Agar, G.; Özkan, H.; Kartal, N.; Polissiou, M.; Sökmen, A.; Sahín, F.,
In vitro antibacterial, antifungal, and antioxidant activities of the essential oil and methanol extracts of herbal parts and callus cultures of Satureja hortensis L.,
J. Agric. Food Chem., 2003, 51, 14, 3958-3965, https://doi.org/10.1021/jf0340308
. [all data]
Jordán, Martínez, et al., 2003
Jordán, M.J.; Martínez, R.M.; Cases, M.A.; Sotomayor. J.A.,
Watering level effect on Thymus hyemalis lange essential oil yield and composition,
J. Agric. Food Chem., 2003, 51, 18, 5420-5427, https://doi.org/10.1021/jf034335m
. [all data]
Baratta, Dorman, et al., 1998
Baratta, M.T.; Dorman, H.J.; Deans, S.G.; Figueiredo, A.C.; Barroso, J.G.; Ruberto, G.,
Antimicrobial and antioxidant properties of some commercial essential oils,
Flavour Fragr. J., 1998, 13, 4, 235-244, https://doi.org/10.1002/(SICI)1099-1026(1998070)13:4<235::AID-FFJ733>3.0.CO;2-T
. [all data]
Anitescu, Doneanu, et al., 1997
Anitescu, G.; Doneanu, C.; Radulescu, V.,
Isolation of Coriander oil: comparison between steam distillation and supercritical CO2 extraction,
Flavour Fragr. J., 1997, 12, 3, 173-176, https://doi.org/10.1002/(SICI)1099-1026(199705)12:3<173::AID-FFJ630>3.0.CO;2-1
. [all data]
Zenkevich, 1997
Zenkevich, I.G.,
Analytical Parameters of Components of Essential Oils for their Chromatographic and Chromato-Spectral Identificaiton. Oxsigenated derivatives of Mono- and Sesquiterpene Hydrocarbons,
Rastit, Resursy (Rus.), 1997, 33, 1, 16-28. [all data]
Grundschober, 1991
Grundschober, F.,
The identification of individual components in flavourings and flavoured foods,
Z. Lebensm. Unters. Forsch., 1991, 192, 6, 530-534, https://doi.org/10.1007/BF01202508
. [all data]
Shibamoto, 1987
Shibamoto, T.,
Retention Indices in Essential Oil Analysis
in Capillary Gas Chromatography in Essential Oil Analysis, Sandra, P.; Bicchi, C., ed(s)., Hutchig Verlag, Heidelberg, New York, 1987, 259-274. [all data]
Waggott and Davies, 1984
Waggott, A.; Davies, I.W.,
Identification of organic pollutants using linear temperature programmed retention indices (LTPRIs) - Part II, 1984, retrieved from http://dwi.defra.gov.uk/research/completed-research/reports/dwi0383.pdf. [all data]
Ardrey and Moffat, 1981
Ardrey, R.E.; Moffat, A.C.,
Gas-liquid chromatographic retention indices of 1318 substances of toxicological interest on SE-30 or OV-1 stationary phase,
J. Chromatogr., 1981, 220, 3, 195-252, https://doi.org/10.1016/S0021-9673(00)81925-1
. [all data]
Dregus and Engel, 2003
Dregus, M.; Engel, K.-H.,
Volatile constituents of uncooked Rhubarb (Rheum rhabarbarum L.) stalks,
J. Agric. Food Chem., 2003, 51, 22, 6530-6536, https://doi.org/10.1021/jf030399l
. [all data]
Lin, Cai, et al., 2003
Lin, P.; Cai, J.; Li, J.; Sang, W.; Su, Q.,
Constituents of the essential oil of Hemerocallis flava day lily,
Flavour Fragr. J., 2003, 18, 6, 539-541, https://doi.org/10.1002/ffj.1264
. [all data]
Miyazawa, Yamafuji, et al., 2003
Miyazawa, M.; Yamafuji, C.; Kurose, K.; Ishikawa, Y.,
Volatile components of the rhizomes of Cirsium japonicum DC,
Flavour Fragr. J., 2003, 18, 1, 15-17, https://doi.org/10.1002/ffj.1135
. [all data]
Kaya, Baser, et al., 1999
Kaya, A.; Baser, K.H.C.; Koca, F.,
Essential oils of Acinos troodi (Post) Leblebici subsp. vardaranus Leblebici and subsp. grandiflorus Hartvig Strid,
Flavour Fragr. J., 1999, 14, 1, 50-54, https://doi.org/10.1002/(SICI)1099-1026(199901/02)14:1<50::AID-FFJ783>3.0.CO;2-7
. [all data]
Shuichi, Masazumi, et al., 1996
Shuichi, H.; Masazumi, N.; Hiromu, K.; Kiyoshi, F.,
Comparison of volatile compounds berween the crude drugs, Onji-tsutsu and Onji-niki,
Nippon nogei kagaku kaishi, 1996, 70, 2, 151-160. [all data]
Stancher and Pertoldi, 1967
Stancher, B.; Pertoldi, M.G.,
Characterization of commercial materials used in synthetic essential oil production. Identification and gas-chromatographic determination of impurities,
Rassegna chimica, 1967, 19, 3, 99-109. [all data]
Prompona, Kandylis, et al., 2012
Prompona, K.-D.; Kandylis, P.; Tsakiris, A.; Kanellaki, M.; Kourkoutas, Y.,
Application of alternative technologies for elimination of artificial colorings in alcoholic beverages produced by Citrus medica and potential impact on human health,
Food Nutrition Sci., 2012, 3, 07, 959-969, https://doi.org/10.4236/fns.2012.37127
. [all data]
Xiao, Dai, et al., 2011
Xiao, Z.; Dai, S.; Niu, Y.; Yu, H.; Zhu, J.; Tian, H.; Gu, Y.,
Discrimination of Chinese vinegars based on headspace solid-phase microextraction - gas chromatography mass spectrometry of volatile compounds and multivariate analysis,
J. Food Sci., 2011, 76, 8, c1125-c1135, https://doi.org/10.1111/j.1750-3841.2011.02356.x
. [all data]
Shu and Shen, 2008
Shu, N.; Shen, H.,
Aroma-impact compounds in Lysimachia foenum-graecum extracts,
Flavour Fragr. J., 2008, 24, 1, 1-6, https://doi.org/10.1002/ffj.1908
. [all data]
Chaieb, Hajlaoui, et al., 2007
Chaieb, K.; Hajlaoui, H.; Zmantar, T.; Ben Kahla-Nakbi, A.; Rouabhia, M.; Mahdouani, K.; Bakhrouf, A.,
The chemical composition and biological activity of clove essential oil, Eugenia caryophyllata (Syzigium aromaticum L. Myrtaceae): a short review,
Phytoterapy Res., 2007, 21, 6, 501-506, https://doi.org/10.1002/ptr.2124
. [all data]
Tabanca N., Demirci B., et al., 2007
Tabanca N.; Demirci B.; Baser K.H.C.; Mincsovics E.; Khan S.I.; Jacob M.R.; Wedge D.E.,
Characterization of volatile constituents of Scaligeria tripartita and studies on the antifungal activity against phytopathogenic fungi,
J. Chromatogr. B, 2007, 850, 1-2, 221-229, https://doi.org/10.1016/j.jchromb.2006.11.041
. [all data]
Tabanca, Demirci, et al., 2006
Tabanca, N.; Demirci, B.; Ozek, T.; Kirimer, N.; Can Baser, K.H.; Bedir, E.; Khan, I.A.; Wedge, D.E.,
Gas chromatographic-mass spectrometric analysis of essential oils from Pimpinella species gathered from Central and Northern Turkey,
J. Chromatogr. A, 2006, 1117, 2, 194-205, https://doi.org/10.1016/j.chroma.2006.03.075
. [all data]
Tabanca, Demirci, et al., 2005
Tabanca, N.; Demirci, B.; Kirimer, N.; Baser, K.H.C.; Bedir, E.; Khand, I.A.; Wedge, D.E.,
Gas chromatographic-mass spectrometric analysis of essential oils from Pimpinella aurea, Pimpinella corymbosa, Pimpinella peregrina and Pimpinella puberula gathered from Eastern and Southern Turkey,
J. Chromatogr. A, 2005, 1097, 1-2, 192-198, https://doi.org/10.1016/j.chroma.2005.10.047
. [all data]
Tabanca N., Demirci F., et al., 2001
Tabanca N.; Demirci F.; Ozek T.; Tumen G.; Baser K.H.C.,
Composition and antimicrobial activity of the essential oil of Origanum x dolichosiphon P. H. Davis,
Chem. Nat. Compd. (Engl. Transl.), 2001, 37, 3, 238-241, https://doi.org/10.1023/A:1012513922871
. [all data]