Butanoic acid, 2-chloro-
- Formula: C4H7ClO2
- Molecular weight: 122.550
- IUPAC Standard InChIKey: RVBUZBPJAGZHSQ-UHFFFAOYSA-N
- CAS Registry Number: 4170-24-5
- Chemical structure:
View 3d structure (requires JavaScript / HTML 5) - Other names: Butyric acid, 2-chloro-; α-Chlorobutyric acid; 2-Chlorobutyric acid; 2-Chlorobutanoic acid; α-Chloro-n-butyric acid

Condensed phase thermochemistry data

Data compiled by: Hussein Y. Afeefy, Joel F. Liebman, and Stephen E. Stein
Quantity | Value | Units | Method | Reference | Comment |
---|---|---|---|---|---|
ΔcH°liquid | -2022.5 ± 8.4 | kJ/mol | Ccb | Smith, Bjellerup, et al., 1953 | Reanalyzed by Cox and Pilcher, 1970, Original value = -2021. ± 8. kJ/mol |
ΔcH°liquid | -2018. | kJ/mol | Ccb | Schjanberg, 1935 |

Gas phase ion energetics data

Data compiled by: John E. Bartmess
De-protonation reactions
C4H6ClO2- + =
By formula: C4H6ClO2- + H+ = C4H7ClO2
Quantity | Value | Units | Method | Reference | Comment |
---|---|---|---|---|---|
ΔrH° | 1410. ± 8.8 | kJ/mol | G+TS | Caldwell, Renneboog, et al., 1989 | gas phase; dHf(AH) from GpAd in Stein, Rikkers, et al. is seriously in error |
ΔrH° | 1412. ± 9.6 | kJ/mol | G+TS | Cumming and Kebarle, 1978 | gas phase |
Quantity | Value | Units | Method | Reference | Comment |
ΔrG° | 1383. ± 8.4 | kJ/mol | IMRE | Caldwell, Renneboog, et al., 1989 | gas phase; dHf(AH) from GpAd in Stein, Rikkers, et al. is seriously in error |
ΔrG° | 1384. ± 8.4 | kJ/mol | IMRE | Cumming and Kebarle, 1978 | gas phase |

Reaction thermochemistry data

Data compiled by: John E. Bartmess
Individual Reactions
C4H6ClO2- + =
By formula: C4H6ClO2- + H+ = C4H7ClO2
Quantity | Value | Units | Method | Reference | Comment |
---|---|---|---|---|---|
ΔrH° | 1410. ± 8.8 | kJ/mol | G+TS | Caldwell, Renneboog, et al., 1989 | gas phase; dHf(AH) from GpAd in Stein, Rikkers, et al. is seriously in error |
ΔrH° | 1412. ± 9.6 | kJ/mol | G+TS | Cumming and Kebarle, 1978 | gas phase |
Quantity | Value | Units | Method | Reference | Comment |
ΔrG° | 1383. ± 8.4 | kJ/mol | IMRE | Caldwell, Renneboog, et al., 1989 | gas phase; dHf(AH) from GpAd in Stein, Rikkers, et al. is seriously in error |
ΔrG° | 1384. ± 8.4 | kJ/mol | IMRE | Cumming and Kebarle, 1978 | gas phase |

References

Smith, Bjellerup, et al., 1953
Smith, L.; Bjellerup, L.; Krook, S.; Westermark, H.,
Heats of combustion of organic chloro compounds determined by the "quartz wool" method,
Acta Chem. Scand., 1953, 7, 65. [all data]
Cox and Pilcher, 1970
Cox, J.D.; Pilcher, G.,
Thermochemistry of Organic and Organometallic Compounds, Academic Press, New York, 1970, 1-636. [all data]
Schjanberg, 1935
Schjanberg, E.,
Die Verbrennungswarmen und die Refraktionsdaten einiger chlorsubstituierter Fettsauren und Ester.,
Z. Phys. Chem. Abt. A, 1935, 172, 197-233. [all data]
Caldwell, Renneboog, et al., 1989
Caldwell, G.; Renneboog, R.; Kebarle, P.,
Gas Phase Acidities of Aliphatic Carboxylic Acids, Based on Measurements of Proton Transfer Equilibria,
Can. J. Chem., 1989, 67, 4, 661, https://doi.org/10.1139/v89-092
. [all data]
Stein, Rikkers, et al.
Stein, S.E.; Rikkers, J.M.; Brown, R.L.,
NIST Structure anmd Properties Database and Estimation Program, Ver. 1.1, NIST Standard Reference Database 25. [all data]
Cumming and Kebarle, 1978
Cumming, J.B.; Kebarle, P.,
Summary of gas phase measurements involving acids AH. Entropy changes in proton transfer reactions involving negative ions. Bond dissociation energies D(A-H) and electron affinities EA(A),
Can. J. Chem., 1978, 56, 1. [all data]