Nitrobenzene-D5
- Formula: C6D5NO2
- Molecular weight: 128.1402
- IUPAC Standard InChIKey: LQNUZADURLCDLV-RALIUCGRSA-N
- CAS Registry Number: 4165-60-0
- Chemical structure:
View 3d structure (requires JavaScript / HTML 5) - Isotopologues:
- Other names: Benzene-D5-, nitro-; [2H5]Benzene, nitro-; nitro(2H5)benzene

Gas phase ion energetics data

Data compiled by: John E. Bartmess
Electron affinity determinations
EA (eV) | Method | Reference | Comment |
---|---|---|---|
1.00 ± 0.10 | TDEq | Stevenson, Reiter, et al., 1987 | EA: 0.19±0.05 kcal/mol less than H5-nitrobenzene. |
1.00 ± 0.020 | ECD | Chen, Chen, et al., 1992 |

References

Stevenson, Reiter, et al., 1987
Stevenson, G.R.; Reiter, R.C.; Espe, M.E.; Bartmess, J.E.; Crowder, C.,
Effect of Isotopic Substitution upon the Gas Phase and Solution Electron Affinities of Nitrobenzene,
J. Am. Chem. Soc., 1987, 109, 13, 3847, https://doi.org/10.1021/ja00247a005
. [all data]
Chen, Chen, et al., 1992
Chen, E.C.M.; Chen, E.S.; Milligan, M.S.; Wentworth, W.E.; Wiley, J.R.,
Experimental Determination of the Electron Affinities of Nitrobenzene, Nitrotoluenes, Pentafluoronitrobenzene, and Isotopic Nitrobenzenes an,
J. Phys. Chem., 1992, 96, 5, 2385, https://doi.org/10.1021/j100184a069
. [all data]