Piperazine, 1,4-dinitro-
- Formula: C4H8N4O4
- Molecular weight: 176.1307
- IUPAC Standard InChIKey: GSUMZAMXDRIYCL-UHFFFAOYSA-N
- CAS Registry Number: 4164-37-8
- Chemical structure:
View 3d structure (requires JavaScript / HTML 5) - Other names: N,N-Dinitropiperazine; N,N'-Dinitropiperazine; 1,4-Dinitropiperazine; 1,4-Dinitro-1,4-diazacyclohexane

Gas phase thermochemistry data

Data compiled by: Hussein Y. Afeefy, Joel F. Liebman, and Stephen E. Stein
Quantity | Value | Units | Method | Reference | Comment |
---|---|---|---|---|---|
ΔfH°gas | 58. ± 3. | kJ/mol | Ccb | Pepekin, Matyushin, et al., 1974 |

Condensed phase thermochemistry data

Data compiled by: Hussein Y. Afeefy, Joel F. Liebman, and Stephen E. Stein
Quantity | Value | Units | Method | Reference | Comment |
---|---|---|---|---|---|
ΔfH°solid | -53. ± 2. | kJ/mol | Ccb | Pepekin, Matyushin, et al., 1974 | |
Quantity | Value | Units | Method | Reference | Comment |
ΔcH°solid | -2664. ± 2. | kJ/mol | Ccb | Pepekin, Matyushin, et al., 1974 |

Phase change data

Data compiled as indicated in comments:
ALS - Hussein Y. Afeefy, Joel F. Liebman, and Stephen E. Stein
AC - William E. Acree, Jr., James S. Chickos
Quantity | Value | Units | Method | Reference | Comment |
---|---|---|---|---|---|
ΔsubH° | 111. ± 0.8 | kJ/mol | V | Pepekin, Matyushin, et al., 1974 | ALS |
Enthalpy of sublimation
ΔsubH (kJ/mol) | Temperature (K) | Reference | Comment |
---|---|---|---|
111. ± 8. | 343. | Pepekin, Matyushin, et al., 1974 | Based on data from 325. to 360. K. See also Pedley and Rylance, 1977.; AC |
Enthalpy of fusion
ΔfusH (kJ/mol) | Temperature (K) | Method | Reference | Comment |
---|---|---|---|---|
200.8 | 489.2 | N/A | Oxley, Smith, et al., 2001 | Enthalpy of fusion is abnormally high, compound may be decomposing; AC |
33.93 | 489.6 | DSC | Zeman, 1997 | AC |

References

Pepekin, Matyushin, et al., 1974
Pepekin, V.I.; Matyushin, Yu.N.; Lebedev, Yu.A.,
Thermochemistry of N-nitro- and N-nitrosoamines of the alicyclic series,
Bull. Acad. Sci. USSR, Div. Chem. Sci., 1974, 1707-1710. [all data]
Pedley and Rylance, 1977
Pedley, J.B.; Rylance, J.,
, Computer Analysed Thermochemical Data: Organic and Organometallic Compounds, University of Sussex, Brighton, 1977. [all data]
Oxley, Smith, et al., 2001
Oxley, J.C.; Smith, J.L.; Zhang, J.; Bedford, C.,
A Comparison of the Thermal Decomposition of Nitramines and Difluoramines,
J. Phys. Chem. A, 2001, 105, 3, 579-590, https://doi.org/10.1021/jp002516a
. [all data]
Zeman, 1997
Zeman, Svatopluk,
Some predictions in the field of the physical thermal stability of nitramines,
Thermochimica Acta, 1997, 302, 1-2, 11-16, https://doi.org/10.1016/S0040-6031(96)03101-2
. [all data]