N-[2-[(2,6-dicyano-4-nitrophenyl)azo]-5-(diethylamino)phenyl]acetamide
- Formula: C20H19N7O4
- Molecular weight: 421.4094
- CAS Registry Number: 41642-51-7

Phase change data

Data compiled by: William E. Acree, Jr., James S. Chickos
Enthalpy of sublimation
ΔsubH (kcal/mol) | Temperature (K) | Method | Reference | Comment |
---|---|---|---|---|
21.7 | 474. | GS | Nishida, Ando, et al., 2008 | The molecular structure of the compound given in the paper had a Cl group and only one CN functional group, which is different than the molecular structure given in Scifinder Scholar for Disperse Blue 165. The molecular formula for the structure in the paper is <sub>20</sub>H<sub>21</sub>ClN<sub>6</sub>O<sub>3</sub>. The molecular weight given in the paper, 405, agrees with the molecular formula of C<sub>20</sub>H<sub>19</sub>N<sub>7</sub>O<sub>4</sub>. We have assumed that the chemical name is correct, but that the authors misdrew the molecular structure. |

References

Nishida, Ando, et al., 2008
Nishida, K.; Ando, Y.; Ohwada, K.; Mori, T.; Koide, M.; Koukitsu, A.,
Vapour pressures and heats of sublimation of some azo disperse dyes,
J Food Science, 2008, 105, 3, 112-114, https://doi.org/10.1111/j.1478-4408.1989.tb01200.x
. [all data]