butyl-1,1'-biphenyl
- Formula: C16H18
- Molecular weight: 210.3141
- IUPAC Standard InChIKey: RMSGQZDGSZOJMU-UHFFFAOYSA-N
- CAS Registry Number: 41638-55-5
- Chemical structure:
View 3d structure (requires JavaScript / HTML 5) - Species with the same structure:
- Other names: 1,1'-Biphenyl, butyl-

Condensed phase thermochemistry data

Data compiled by: Hussein Y. Afeefy, Joel F. Liebman, and Stephen E. Stein
Quantity | Value | Units | Method | Reference | Comment |
---|---|---|---|---|---|
ΔcH°liquid | -8889.3 | kJ/mol | Ccb | Wise, Serijan, et al., 1951 | Corresponding ΔfHºliquid = 21. kJ/mol (simple calculation by NIST; no Washburn corrections) |

References

Wise, Serijan, et al., 1951
Wise, C.H.; Serijan, K.T.; Goodman, I.A.,
NACA Technical Report 1003,
NACA Technical Report 1003, 1951, 1-10. [all data]