2,4-Dimethyl 1,4-pentadiene
- Formula: C7H12
- Molecular weight: 96.1702
- IUPAC Standard InChIKey: ANKJYUSZUBOYDV-UHFFFAOYSA-N
- CAS Registry Number: 4161-65-3
- Chemical structure:

Normal alkane RI, non-polar column, custom temperature program

Column type | Active phase | I | Reference | Comment |
---|---|---|---|---|
Packed | Apieson L | 780. | Kojima, Fujii, et al., 1980 | Chromosorb W; Column length: 20. m; Program: not specified |

References

Kojima, Fujii, et al., 1980
Kojima, T.; Fujii, T.; Hosaka, Y.,
Thermal decomposition products of sterepisomeric polypropylenes,
Mass Spectrometry, 1980, 28, 4, 335-341. [all data]