2-Pentanone, 4-hydroxy-
- Formula: C5H10O2
- Molecular weight: 102.1317
- IUPAC Standard InChIKey: PCYZZYAEGNVNMH-UHFFFAOYSA-N
- CAS Registry Number: 4161-60-8
- Chemical structure:
View 3d structure (requires JavaScript / HTML 5) - Other names: CH3CH(OH)CH2C(O)CH3; 4-Hydroxy-4-methyl-2-butanone; 4-Hydroxy-2-pentanone; 4-hydroxypentan-2-one

Phase change data

Data compiled by: Thermodynamics Research Center, NIST Boulder Laboratories, Chris Muzny director
Quantity | Value | Units | Method | Reference | Comment |
---|---|---|---|---|---|
Tboil | 450.15 | K | N/A | Sabatier and Mailhe, 1909 | Uncertainty assigned by TRC = 2. K |
Tboil | 450.15 | K | N/A | Sabatier and Mailhe, 1907 | Uncertainty assigned by TRC = 3. K |

Reaction thermochemistry data

Data compiled by: Hussein Y. Afeefy, Joel F. Liebman, and Stephen E. Stein
Individual Reactions
By formula: C7H12O3 + H2O = C5H10O2 + C2H4O2
Quantity | Value | Units | Method | Reference | Comment |
---|---|---|---|---|---|
ΔrH° | 12. | kJ/mol | Eqk | Grigor'ev, Katsman, et al., 1981 | liquid phase |

Normal alkane RI, non-polar column, temperature ramp

Column type | Active phase | I | Reference | Comment |
---|---|---|---|---|
Capillary | VF-5 MS | 818. | Leffingwell and Alford, 2011 | 60. m/0.32 mm/0.25 μm, Helium, 2. K/min, 260. C @ 28. min; Tstart: 30. C |
Capillary | VF-5 MS | 822. | Leffingwell and Alford, 2011 | 60. m/0.32 mm/0.25 μm, Helium, 2. K/min, 260. C @ 28. min; Tstart: 30. C |
Capillary | HP-5 | 849.4 | Leffingwell and Alford, 2005 | 60. m/0.32 mm/0.25 μm, He, 30. C @ 2. min, 2. K/min, 260. C @ 28. min |

References

Sabatier and Mailhe, 1909
Sabatier, P.; Mailhe, A.,
New Applications of the General Method of Hydrogenation with Various Metals,
Ann. Chim. Phys., 1909, 16, 70. [all data]
Sabatier and Mailhe, 1907
Sabatier, P.; Mailhe, A.,
The Direct Hydrogenation of Methyl Diketones,
C. R. Hebd. Seances Acad. Sci., 1907, 144, 1086. [all data]
Grigor'ev, Katsman, et al., 1981
Grigor'ev, A.A.; Katsman, E.A.; Bobrov, A.F.; Dan'ko, T.N.; Pinkhasik, E.V.,
Preparation of γ-acetopropyl alcohol,
Sov. Chem. Ind. (Engl. Transl.), 1981, 967-972. [all data]
Leffingwell and Alford, 2011
Leffingwell, J.; Alford, E.D.,
Volatile constituents of the giant pufball mushroom (Calvatia gigantea),
Leffingwell Rep., 2011, 4, 1-17. [all data]
Leffingwell and Alford, 2005
Leffingwell, J.C.; Alford, E.D.,
Volatile constituents of Perique tobacco,
Electron. J. Environ. Agric. Food Chem., 2005, 4, 2, 899-915. [all data]