Pt[(OOC)2CHEt](NH3)2
- Formula: C5H12N2O4Pt
- Molecular weight: 359.244
- CAS Registry Number: 41575-93-3

Condensed phase thermochemistry data

Data compiled by: José A. Martinho Simões
Quantity | Value | Units | Method | Reference | Comment |
---|---|---|---|---|---|
ΔfH°solid | -1089.0 ± 3.2 | kJ/mol | Review | Martinho Simões | The enthalpy of formation relies on -467.2 ± 3.0 kJ/mol for the enthalpy of formation of cis-Pt(Cl)2(NH3)2(cr). |

Phase change data

Data compiled by: José A. Martinho Simões
Quantity | Value | Units | Method | Reference | Comment |
---|---|---|---|---|---|
ΔsubH° | 290. ± 20. | kJ/mol | RSC | Mortimer, 1984 |

Gas phase thermochemistry data

Data compiled by: José A. Martinho Simões
Quantity | Value | Units | Method | Reference | Comment |
---|---|---|---|---|---|
ΔfH°gas | -191.0 ± 4.9 | kcal/mol | Review | Martinho Simões | The enthalpy of formation relies on -111.7 ± 0.72 kcal/mol for the enthalpy of formation of cis-Pt(Cl)2(NH3)2(cr). |

References

Martinho Simões
Martinho Simões, J.A.,
Private communication (see http://webbook.nist.gov/chemistry/om/). [all data]
Mortimer, 1984
Mortimer, C.T.,
Rev. Inorg. Chem., 1984, 6, 233. [all data]