Acetamide,N,N'-[oxybis{6-(1,3-dihydro-1,3-dioxo-2H-isoindol-2-yl)-3,1-phenylene}]bis-

Condensed phase thermochemistry data

Data compiled by: Hussein Y. Afeefy, Joel F. Liebman, and Stephen E. Stein

Quantity Value Units Method Reference Comment
Δfsolid-636.8kJ/molCcbPavlinov, Rusanov, et al., 1974
Quantity Value Units Method Reference Comment
Δcsolid-15100. ± 4.kJ/molCcbPavlinov, Rusanov, et al., 1974

References

Pavlinov, Rusanov, et al., 1974
Pavlinov, L.I.; Rusanov, A.L.; Papulova, L.V.; Niyazi, F.F.; Korshak, V.V., Determination of the composition of polymers with diverse links, Polym. Sci. USSR, 1974, 16, 3098-3104. [all data]