Bicyclo[3.3.0]octa-2,6-diene
- Formula: C8H10
- Molecular weight: 106.1650
- IUPAC Standard InChIKey: VRHOGTVMWMQIIC-UHFFFAOYSA-N
- CAS Registry Number: 41527-66-6
- Chemical structure:
View 3d structure (requires JavaScript / HTML 5) - Permanent link for this species. Use this link for bookmarking this species for future reference.

Reaction thermochemistry data

Data compiled by: Hussein Y. Afeefy, Joel F. Liebman, and Stephen E. Stein
Individual Reactions
By formula: 2H2 + C8H10 = C8H14
Quantity | Value | Units | Method | Reference | Comment |
---|---|---|---|---|---|
ΔrH° | -227. ± 2. | kJ/mol | Chyd | Rogers, Loggins, et al., 1990 | liquid phase; solvent: Hexane |

References

Rogers, Loggins, et al., 1990
Rogers, D.W.; Loggins, S.A.; Samuel, S.D.; Finnerty, M.A.; Liebman, J.F.,
Homoaromaticity and homoconjugation in the quinacenes: biquinacene, triquinacene, and hexaquinacene,
Struct. Chem., 1990, 1, 481-489. [all data]