bis(triethylgermyl)mercury
- Formula: C12H30Ge2Hg
- Molecular weight: 520.24
- CAS Registry Number: 4149-28-4

Phase change data

Data compiled by: William E. Acree, Jr., James S. Chickos
Enthalpy of vaporization
ΔvapH (kJ/mol) | Temperature (K) | Reference | Comment |
---|---|---|---|
64.8 | 393. | Bragin, Karapet'yants, et al., 1972 | Based on data from 383. to 403. K. |
64.8 | 393. | Bragin, Karapet'yants, et al., 1972 | Based on data from 383. to 403. K. |

References

Bragin, Karapet'yants, et al., 1972
Bragin, G.P.; Karapet'yants, M.Kh.; Goncharov, A.K.; Kol'yakova, G.M.,
Tr. Mosk. Khim. Tekhnol. Inst., 1972, 71, 10. [all data]