Dipropetryn
- Formula: C11H19N5S
- Molecular weight: 253.367
- IUPAC Standard InChIKey: NPWMZOGDXOFZIN-UHFFFAOYSA-N
- CAS Registry Number: 4147-51-7
- Chemical structure:
View 3d structure (requires JavaScript / HTML 5) - Other names: 1,3,5-Triazine-2,4-diamine, 6-(ethylthio)-N,N'-bis(1-methylethyl)-; s-Triazine, 2-(ethylthio)-4,6-bis(isopropylamino)-; Cotofor; GS 16068; Sancap; Dipropetryne; s-Triazine, 2,4-bis(isopropylamino)-6-ethylthio-; 2-Ethylthio-4,6-bis(isopropylamino)-s-triazine; 6-(Ethylthio)-N,N'-bis(1-methylethyl)-1,3,5-triazine-2,4-diamine

Phase change data

Data compiled as indicated in comments:
TRC - Thermodynamics Research Center, NIST Boulder Laboratories, Chris Muzny director
AC - William E. Acree, Jr., James S. Chickos
Quantity | Value | Units | Method | Reference | Comment |
---|---|---|---|---|---|
Tfus | 378.13 | K | N/A | Donnelly, Drewes, et al., 1990 | Uncertainty assigned by TRC = 0.2 K; TRC |
Enthalpy of fusion
ΔfusH (kcal/mol) | Temperature (K) | Method | Reference | Comment |
---|---|---|---|---|
5.722 | 377.7 | DSC | Acree, 1991 | See also Donnelly, Drewes, et al., 1990, 2.; AC |
5.722 | 377.7 | DSC | Donnelly, Drewes, et al., 1990, 2 | AC |

Kovats' RI, non-polar column, isothermal

Column type | Active phase | Temperature (C) | I | Reference | Comment |
---|---|---|---|---|---|
Capillary | OV-1 | 190. | 1924. | Erdmann, Rochholz, et al., 1992 | |
Capillary | OV-1 | 220. | 1925. | Erdmann, Rochholz, et al., 1992 |

References

Donnelly, Drewes, et al., 1990
Donnelly, J.R.; Drewes, L.A.; Johnson, R.L.; Munslow, W.D.; Knapp, K.K.; Sovocool, G.W.,
Purity and heat of fusion data for environmental standards as determined by differential scanning calorimetry,
Thermochim. Acta, 1990, 167, 2, 155, https://doi.org/10.1016/0040-6031(90)80476-F
. [all data]
Acree, 1991
Acree, William E.,
Thermodynamic properties of organic compounds: enthalpy of fusion and melting point temperature compilation,
Thermochimica Acta, 1991, 189, 1, 37-56, https://doi.org/10.1016/0040-6031(91)87098-H
. [all data]
Donnelly, Drewes, et al., 1990, 2
Donnelly, J.R.; Drewes, L.A.; Johnson, R.L.; Munslow, W.D.; Knapp, K.K.; Sovocool, G.W.,
Purity and heat of fusion data for environmental standards as determined by differential scanning calorimetry,
Thermochimica Acta, 1990, 167, 2, 155-187, https://doi.org/10.1016/0040-6031(90)80476-F
. [all data]
Erdmann, Rochholz, et al., 1992
Erdmann, F.; Rochholz, G.; Schütz, H.,
Retention-indices on OV-1 of approximately 170 commonly used pesticides,
Mikrochim. Acta, 1992, 106, 3-6, 219-226, https://doi.org/10.1007/BF01242093
. [all data]