7-Tetradecene, (E)-
- Formula: C14H28
- Molecular weight: 196.3721
- IUPAC Standard InChIKey: UBDIXSAEHLOROW-BUHFOSPRSA-N
- CAS Registry Number: 41446-63-3
- Chemical structure:
View 3d structure (requires JavaScript / HTML 5) - Stereoisomers:
- Other names: (7E)-7-Tetradecene; (E)-7-Tetradecene; E-Tetradec-7-ene; trans-7-tetradecene

Phase change data

Data compiled by: Robert L. Brown and Stephen E. Stein
Quantity | Value | Units | Method | Reference | Comment |
---|---|---|---|---|---|
Tboil | 523.2 | K | N/A | Aldrich Chemical Company Inc., 1990 |

Kovats' RI, non-polar column, isothermal

Column type | Active phase | Temperature (C) | I | Reference | Comment |
---|---|---|---|---|---|
Capillary | Squalane | 100. | 1374. | Heinzen, Soares, et al., 1999 | |
Capillary | SE-30 | 120. | 1384. | Gusev, Sokolov, et al., 1989 | H2; Column length: 40. m; Column diameter: 0.30 mm |
Capillary | OV-101 | 110. | 1383. | Rang, Kuningas, et al., 1987 | He; Column length: 50. m; Column diameter: 0.25 mm |
Capillary | Squalane | 74. | 1373.6 | Soják, Kraus, et al., 1982 | Column length: 62. m; Column diameter: 0.25 mm |
Capillary | Squalane | 100. | 1374. | Sojak, Hrivnak, et al., 1973 | |
Capillary | Squalane | 130. | 1376. | Sojak, Hrivnak, et al., 1973 |

Kovats' RI, polar column, isothermal

Column type | Active phase | Temperature (C) | I | Reference | Comment |
---|---|---|---|---|---|
Capillary | PEG-20M | 80. | 1417.4 | Orav, Kuningas, et al., 1993 | 100. m/0.25 mm/0.12 μm |
Capillary | PEG-20M | 80. | 1423.5 | Orav, Kuningas, et al., 1993 | 100. m/0.25 mm/0.24 μm |
Capillary | PEG-20M | 80. | 1423.3 | Orav, Kuningas, et al., 1993 | 60. m/0.32 mm/0.25 μm |
Capillary | PEG-20M | 65. | 1416. | Rang, Orav, et al., 1988 | |
Capillary | PEG-20M | 65. | 1421. | Rang, Orav, et al., 1988 | |
Capillary | PEG-20M | 65. | 1422. | Rang, Orav, et al., 1988 | |
Capillary | PEG-20M | 65. | 1422. | Rang, Orav, et al., 1988 | |
Capillary | PEG-20M | 70. | 1417. | Rang, Orav, et al., 1988 | |
Capillary | PEG-20M | 70. | 1422. | Rang, Orav, et al., 1988 | |
Capillary | PEG-20M | 70. | 1422. | Rang, Orav, et al., 1988 | |
Capillary | PEG-20M | 70. | 1423. | Rang, Orav, et al., 1988 | |
Capillary | PEG-20M | 80. | 1421. | Rang, Orav, et al., 1988 | |
Capillary | PEG 4000 | 100. | 1431. | Rang, Orav, et al., 1988 | |
Capillary | PEG 4000 | 110. | 1432. | Rang, Orav, et al., 1988 | |
Capillary | PEG 4000 | 120. | 1432. | Rang, Orav, et al., 1988 | |
Capillary | PEG 4000 | 140. | 1434. | Rang, Orav, et al., 1988 | |
Capillary | PEG 4000 | 160. | 1435. | Rang, Orav, et al., 1988 | |
Capillary | PEG-20M | 120. | 1427. | Rang, Orav, et al., 1988 | |
Capillary | PEG-20M | 130. | 1428. | Rang, Orav, et al., 1988 | |
Capillary | PEG-20M | 140. | 1428. | Rang, Orav, et al., 1988 | |
Capillary | PEG-20M | 150. | 1429. | Rang, Orav, et al., 1988 | |
Capillary | PEG-20M | 160. | 1430. | Rang, Orav, et al., 1988 | |
Capillary | PEG-20M | 65. | 1413.9 | Orav, Kuningas, et al., 1985 | Column length: 100. m; Column diameter: 0.25 mm |
Capillary | PEG-20M | 65. | 1421.7 | Orav, Kuningas, et al., 1985 | Column length: 100. m; Column diameter: 0.25 mm |
Capillary | PEG-20M | 70. | 1415.8 | Orav, Kuningas, et al., 1985 | Column length: 100. m; Column diameter: 0.25 mm |
Capillary | PEG-20M | 70. | 1422.3 | Orav, Kuningas, et al., 1985 | Column length: 100. m; Column diameter: 0.25 mm |
Capillary | PEG-20M | 65. | 1412.5 | Orav, Kuningas, et al., 1985 | Column length: 50. m; Column diameter: 0.25 mm |
Capillary | PEG-20M | 65. | 1415.8 | Orav, Kuningas, et al., 1985 | Column length: 50. m; Column diameter: 0.25 mm |
Capillary | PEG-20M | 65. | 1420.6 | Orav, Kuningas, et al., 1985 | Column length: 50. m; Column diameter: 0.25 mm |
Capillary | PEG-20M | 65. | 1421.5 | Orav, Kuningas, et al., 1985 | Column length: 50. m; Column diameter: 0.25 mm |
Capillary | PEG-20M | 70. | 1414.7 | Orav, Kuningas, et al., 1985 | Column length: 50. m; Column diameter: 0.25 mm |
Capillary | PEG-20M | 70. | 1417.3 | Orav, Kuningas, et al., 1985 | Column length: 50. m; Column diameter: 0.25 mm |
Capillary | PEG-20M | 70. | 1421.6 | Orav, Kuningas, et al., 1985 | Column length: 50. m; Column diameter: 0.25 mm |
Capillary | PEG-20M | 70. | 1423. | Orav, Kuningas, et al., 1985 | Column length: 50. m; Column diameter: 0.25 mm |
Capillary | PEG 4000 | 100. | 1431. | Rang, Kuningas, et al., 1977 | Column diameter: 0.25 mm |
Capillary | PEG 4000 | 120. | 1432. | Rang, Kuningas, et al., 1977 | Column diameter: 0.25 mm |
Capillary | PEG 4000 | 140. | 1434. | Rang, Kuningas, et al., 1977 | Column diameter: 0.25 mm |
Capillary | PEG 4000 | 160. | 1435. | Rang, Kuningas, et al., 1977 | Column diameter: 0.25 mm |

Van Den Dool and Kratz RI, non-polar column, custom temperature program

Column type | Active phase | I | Reference | Comment |
---|---|---|---|---|
Capillary | BPX-5 | 1396. | Cardeal, da Silva, et al., 2006 | 30. m/0.25 mm/0.25 μm; Program: 35C(5min) => 3C/min => 210C => 40C/min => 240C (4min) |

Normal alkane RI, non-polar column, custom temperature program

Column type | Active phase | I | Reference | Comment |
---|---|---|---|---|
Capillary | Polydimethyl siloxane | 1374. | Junkes, Castanho, et al., 2003 | Program: not specified |

References

Aldrich Chemical Company Inc., 1990
Aldrich Chemical Company Inc.,
Catalog Handbook of Fine Chemicals, Aldrich Chemical Company, Inc., Milwaukee WI, 1990, 1. [all data]
Heinzen, Soares, et al., 1999
Heinzen, V.E.F.; Soares, M.F.; Yunes, R.A.,
Semi-empirical topological method for the prediction of the chromatographic retention of cis- and trans-alkene isomers and alkanes,
J. Chromatogr. A, 1999, 849, 2, 495-506, https://doi.org/10.1016/S0021-9673(99)00530-0
. [all data]
Gusev, Sokolov, et al., 1989
Gusev, G.M.; Sokolov, V.P.; Yurov, V.V.; Kuznetsov, A.V.; Potatuev, A.A.,
Identification of olefins during hydrocarboxylation,
Zh. Anal. Khim., 1989, 44, 551-555. [all data]
Rang, Kuningas, et al., 1987
Rang, S.; Kuningas, K.; Strenze, T.; Orav, A.; Eisen, O.,
Retention and Thermodynamics of Solution of n-Alkenes in OV-101,
J. Chromatogr., 1987, 406, 75-80, https://doi.org/10.1016/S0021-9673(00)94018-4
. [all data]
Soják, Kraus, et al., 1982
Soják, L.; Kraus, G.; Farkas, P.; Ostovský, I.,
Hochleistungs-gaschromatographie an flüssigkristall-glaskapillaren. V. Trennung von isomeren n-tridecenen und n-tetradecenen,
J. Chromatogr., 1982, 238, 1, 51-57, https://doi.org/10.1016/S0021-9673(00)82710-7
. [all data]
Sojak, Hrivnak, et al., 1973
Sojak, L.; Hrivnak, J.; Majer, P.; Janak, J.,
Capillary Gas Chromatography of Linear Alkenes on Squalane,
Anal. Chem., 1973, 45, 2, 293-302, https://doi.org/10.1021/ac60324a039
. [all data]
Orav, Kuningas, et al., 1993
Orav, A.; Kuningas, K.; Rang, S.,
A comparison of different retention index systems with unsaturated and aromatic hydrocarbons in capillary gas chromatography on PEG 20MK,
Chromatographia, 1993, 37, 7/8, 411-414, https://doi.org/10.1007/BF02272257
. [all data]
Rang, Orav, et al., 1988
Rang, S.A.; Orav, A.E.; Kuningas, K.R.; Meister, A.E.; Strense, T.V.; Eisen, O.G.,
Gas-Chromatographic Characteristics of unsaturated hydrocarbons, Academy of Sciences of Estonia SSR, Tallinn, Estonia SSR, 1988, 208. [all data]
Orav, Kuningas, et al., 1985
Orav, A.; Kuningas, K.; Rang, S.; Eisen, O.,
Capillary gas chromatography of n-tridecenes, n-tetradecenes and C10-C14 n-alkynes on polyethylene glycol 20m of different polarity,
Eesti NSV Tead. Akad. Toim. Keem., 1985, 34, 2, 105-113. [all data]
Rang, Kuningas, et al., 1977
Rang, S.; Kuningas, K.; Orav, A.; Eisen, O.,
Capillary Gas Chromatography of C6-C14 n-Alkenes on Polyphenyl Ether and Polyethylene Glycol 4000,
Chromatographia, 1977, 10, 2, 55-64, https://doi.org/10.1007/BF02274460
. [all data]
Cardeal, da Silva, et al., 2006
Cardeal, Z.L.; da Silva, M.D.R.G.; Marriott, P.J.,
Comprehensive two-dimensional gas chromatography/mass spectrometric analysis of pepper volatiles,
Rapid Commun. Mass Spectrom., 2006, 20, 19, 2823-2836, https://doi.org/10.1002/rcm.2665
. [all data]
Junkes, Castanho, et al., 2003
Junkes, B.S.; Castanho, R.D.M.; Amboni, C.; Yunes, R.A.; Heinzen, V.E.F.,
Semiempirical Topological Index: A Novel Molecular Descriptor for Quantitative Structure-Retention Relationship Studies,
Internet Electronic Journal of Molecular Design, 2003, 2, 1, 33-49. [all data]