2-Tridecene, (E)
- Formula: C13H26
- Molecular weight: 182.3455
- IUPAC Standard InChIKey: XWVHBWQEYOROBE-HWKANZROSA-N
- CAS Registry Number: 41446-58-6
- Chemical structure:
View 3d structure (requires JavaScript / HTML 5) - Stereoisomers:
- Other names: (2E)-2-Tridecene; trans-2-Tridecene; (E)-2-Tridecene

Reaction thermochemistry data

Data compiled by: Hussein Y. Afeefy, Joel F. Liebman, and Stephen E. Stein
Individual Reactions
By formula: C13H26 = C13H26
Quantity | Value | Units | Method | Reference | Comment |
---|---|---|---|---|---|
ΔrH° | -6.3 | kJ/mol | Eqk | Doering, Estel, et al., 1973 | liquid phase |

Kovats' RI, non-polar column, isothermal

Column type | Active phase | Temperature (C) | I | Reference | Comment |
---|---|---|---|---|---|
Capillary | Squalane | 100. | 1297. | Heinzen, Soares, et al., 1999 | |
Capillary | OV-101 | 110. | 1302. | Rang, Kuningas, et al., 1987 | He; Column length: 50. m; Column diameter: 0.25 mm |
Capillary | Squalane | 74. | 1297.7 | Soják, Kraus, et al., 1982 | Column length: 62. m; Column diameter: 0.25 mm |
Capillary | Squalane | 100. | 1297. | Sojak, Hrivnak, et al., 1973 | |
Capillary | Squalane | 115. | 1297. | Sojak, Hrivnak, et al., 1973 | |
Capillary | Squalane | 130. | 1297. | Sojak, Hrivnak, et al., 1973 | |
Capillary | Squalane | 86. | 1297. | Sojak, Hrivnak, et al., 1973 |

Kovats' RI, polar column, isothermal

Column type | Active phase | Temperature (C) | I | Reference | Comment |
---|---|---|---|---|---|
Capillary | PEG-20M | 80. | 1350.4 | Orav, Kuningas, et al., 1994 | 50. m/0.2 mm/0.13 μm, He |
Capillary | PEG-20M | 80. | 1353.1 | Orav, Kuningas, et al., 1994 | 50. m/0.2 mm/0.19 μm, He |
Capillary | PEG-20M | 80. | 1354.9 | Orav, Kuningas, et al., 1994 | 50. m/0.2 mm/0.22 μm, He |
Capillary | PEG-20M | 65. | 1348. | Rang, Orav, et al., 1988 | |
Capillary | PEG-20M | 65. | 1355. | Rang, Orav, et al., 1988 | |
Capillary | PEG-20M | 65. | 1356. | Rang, Orav, et al., 1988 | |
Capillary | PEG-20M | 65. | 1358. | Rang, Orav, et al., 1988 | |
Capillary | PEG-20M | 70. | 1348. | Rang, Orav, et al., 1988 | |
Capillary | PEG-20M | 70. | 1357. | Rang, Orav, et al., 1988 | |
Capillary | PEG-20M | 70. | 1358. | Rang, Orav, et al., 1988 | |
Capillary | PEG-20M | 80. | 1357. | Rang, Orav, et al., 1988 | |
Capillary | PEG 4000 | 100. | 1365. | Rang, Orav, et al., 1988 | |
Capillary | PEG 4000 | 110. | 1365. | Rang, Orav, et al., 1988 | |
Capillary | PEG 4000 | 120. | 1365. | Rang, Orav, et al., 1988 | |
Capillary | PEG 4000 | 140. | 1365. | Rang, Orav, et al., 1988 | |
Capillary | PEG 4000 | 160. | 1366. | Rang, Orav, et al., 1988 | |
Capillary | PEG-20M | 110. | 1360. | Rang, Orav, et al., 1988 | |
Capillary | PEG-20M | 120. | 1360. | Rang, Orav, et al., 1988 | |
Capillary | PEG-20M | 130. | 1361. | Rang, Orav, et al., 1988 | |
Capillary | PEG-20M | 140. | 1361. | Rang, Orav, et al., 1988 | |
Capillary | PEG-20M | 150. | 1362. | Rang, Orav, et al., 1988 | |
Capillary | PEG-20M | 160. | 1362. | Rang, Orav, et al., 1988 | |
Capillary | PEG-20M | 65. | 1348. | Orav, Kuningas, et al., 1985 | Column length: 100. m; Column diameter: 0.25 mm |
Capillary | PEG-20M | 65. | 1357.9 | Orav, Kuningas, et al., 1985 | Column length: 100. m; Column diameter: 0.25 mm |
Capillary | PEG-20M | 70. | 1349. | Orav, Kuningas, et al., 1985 | Column length: 100. m; Column diameter: 0.25 mm |
Capillary | PEG-20M | 70. | 1358.1 | Orav, Kuningas, et al., 1985 | Column length: 100. m; Column diameter: 0.25 mm |
Capillary | PEG-20M | 65. | 1343.3 | Orav, Kuningas, et al., 1985 | Column length: 50. m; Column diameter: 0.25 mm |
Capillary | PEG-20M | 65. | 1347.5 | Orav, Kuningas, et al., 1985 | Column length: 50. m; Column diameter: 0.25 mm |
Capillary | PEG-20M | 65. | 1355. | Orav, Kuningas, et al., 1985 | Column length: 50. m; Column diameter: 0.25 mm |
Capillary | PEG-20M | 65. | 1355.9 | Orav, Kuningas, et al., 1985 | Column length: 50. m; Column diameter: 0.25 mm |
Capillary | PEG-20M | 70. | 1344.1 | Orav, Kuningas, et al., 1985 | Column length: 50. m; Column diameter: 0.25 mm |
Capillary | PEG-20M | 70. | 1348.4 | Orav, Kuningas, et al., 1985 | Column length: 50. m; Column diameter: 0.25 mm |
Capillary | PEG-20M | 70. | 1357.2 | Orav, Kuningas, et al., 1985 | Column length: 50. m; Column diameter: 0.25 mm |
Capillary | PEG 4000 | 100. | 1365. | Rang, Kuningas, et al., 1977 | Column diameter: 0.25 mm |
Capillary | PEG 4000 | 120. | 1365. | Rang, Kuningas, et al., 1977 | Column diameter: 0.25 mm |
Capillary | PEG 4000 | 140. | 1365. | Rang, Kuningas, et al., 1977 | Column diameter: 0.25 mm |
Capillary | PEG 4000 | 160. | 1366. | Rang, Kuningas, et al., 1977 | Column diameter: 0.25 mm |

Van Den Dool and Kratz RI, non-polar column, custom temperature program

Column type | Active phase | I | Reference | Comment |
---|---|---|---|---|
Capillary | DB-5 | 1305. | Zaikin and Borisov, 2002 | He; Column length: 30. m; Column diameter: 0.25 mm; Program: 30C => 5K/min=120C => 10C/min => 270C |

Normal alkane RI, non-polar column, temperature ramp

Column type | Active phase | I | Reference | Comment |
---|---|---|---|---|
Capillary | Petrocol DH | 1301. | Sojak, Kubinec, et al., 2006 | 150. m/0.25 mm/1.0 μm, 1. K/min; Tstart: 40. C; Tend: 300. C |

Normal alkane RI, non-polar column, custom temperature program

Column type | Active phase | I | Reference | Comment |
---|---|---|---|---|
Capillary | Polydimethyl siloxane | 1297. | Junkes, Castanho, et al., 2003 | Program: not specified |

References

Doering, Estel, et al., 1973
Doering, C.E.; Estel, D.; Fischer, R.; Baberowski, G.; Prinzler, H.,
Analysis of C13 olefins as epoxides by capillary gas chromatography,
Z. Chem., 1973, 13, 257-258. [all data]
Heinzen, Soares, et al., 1999
Heinzen, V.E.F.; Soares, M.F.; Yunes, R.A.,
Semi-empirical topological method for the prediction of the chromatographic retention of cis- and trans-alkene isomers and alkanes,
J. Chromatogr. A, 1999, 849, 2, 495-506, https://doi.org/10.1016/S0021-9673(99)00530-0
. [all data]
Rang, Kuningas, et al., 1987
Rang, S.; Kuningas, K.; Strenze, T.; Orav, A.; Eisen, O.,
Retention and Thermodynamics of Solution of n-Alkenes in OV-101,
J. Chromatogr., 1987, 406, 75-80, https://doi.org/10.1016/S0021-9673(00)94018-4
. [all data]
Soják, Kraus, et al., 1982
Soják, L.; Kraus, G.; Farkas, P.; Ostovský, I.,
Hochleistungs-gaschromatographie an flüssigkristall-glaskapillaren. V. Trennung von isomeren n-tridecenen und n-tetradecenen,
J. Chromatogr., 1982, 238, 1, 51-57, https://doi.org/10.1016/S0021-9673(00)82710-7
. [all data]
Sojak, Hrivnak, et al., 1973
Sojak, L.; Hrivnak, J.; Majer, P.; Janak, J.,
Capillary Gas Chromatography of Linear Alkenes on Squalane,
Anal. Chem., 1973, 45, 2, 293-302, https://doi.org/10.1021/ac60324a039
. [all data]
Orav, Kuningas, et al., 1994
Orav, A.; Kuningas, K.; Kailas, T.; Koplimets, E.; Rang, S.,
Effect of adsorption on the retention values in capillary columns coated with OV-225 and PEG 20M,
J. Chromatogr. A, 1994, 659, 1, 143-150, https://doi.org/10.1016/0021-9673(94)85016-X
. [all data]
Rang, Orav, et al., 1988
Rang, S.A.; Orav, A.E.; Kuningas, K.R.; Meister, A.E.; Strense, T.V.; Eisen, O.G.,
Gas-Chromatographic Characteristics of unsaturated hydrocarbons, Academy of Sciences of Estonia SSR, Tallinn, Estonia SSR, 1988, 208. [all data]
Orav, Kuningas, et al., 1985
Orav, A.; Kuningas, K.; Rang, S.; Eisen, O.,
Capillary gas chromatography of n-tridecenes, n-tetradecenes and C10-C14 n-alkynes on polyethylene glycol 20m of different polarity,
Eesti NSV Tead. Akad. Toim. Keem., 1985, 34, 2, 105-113. [all data]
Rang, Kuningas, et al., 1977
Rang, S.; Kuningas, K.; Orav, A.; Eisen, O.,
Capillary Gas Chromatography of C6-C14 n-Alkenes on Polyphenyl Ether and Polyethylene Glycol 4000,
Chromatographia, 1977, 10, 2, 55-64, https://doi.org/10.1007/BF02274460
. [all data]
Zaikin and Borisov, 2002
Zaikin, V.G.; Borisov, R.S.,
Chromatographic-mass spectrometric analysis of Fishcer-Tropsch synthesis products,
J. Anal. Chem. USSR (Engl. Transl.), 2002, 57, 6, 544-551. [all data]
Sojak, Kubinec, et al., 2006
Sojak, L.; Kubinec, R.; Jurdakova, H.; Hajekova, E.; Bajus, M.,
GC-MS of polyethylene and polypropylene thermal cracking produxts,
Petroleum Coal, 2006, 48, 1, 1-14. [all data]
Junkes, Castanho, et al., 2003
Junkes, B.S.; Castanho, R.D.M.; Amboni, C.; Yunes, R.A.; Heinzen, V.E.F.,
Semiempirical Topological Index: A Novel Molecular Descriptor for Quantitative Structure-Retention Relationship Studies,
Internet Electronic Journal of Molecular Design, 2003, 2, 1, 33-49. [all data]