4-Tridecene, (E)
- Formula: C13H26
- Molecular weight: 182.3455
- IUPAC Standard InChIKey: UJZLNVCZGZKIHR-VQHVLOKHSA-N
- CAS Registry Number: 41446-55-3
- Chemical structure:
View 3d structure (requires JavaScript / HTML 5) - Stereoisomers:
- Other names: trans-4-tridecene; (E)-4-Tridecene

Reaction thermochemistry data

Data compiled by: Hussein Y. Afeefy, Joel F. Liebman, and Stephen E. Stein
Individual Reactions
By formula: C13H26 = C13H26
Quantity | Value | Units | Method | Reference | Comment |
---|---|---|---|---|---|
ΔrH° | -6.3 | kJ/mol | Eqk | Doering, Estel, et al., 1973 | liquid phase |

Kovats' RI, non-polar column, isothermal

Column type | Active phase | Temperature (C) | I | Reference | Comment |
---|---|---|---|---|---|
Capillary | Squalane | 100. | 1280. | Heinzen, Soares, et al., 1999 | |
Capillary | OV-101 | 110. | 1289. | Rang, Kuningas, et al., 1987 | He; Column length: 50. m; Column diameter: 0.25 mm |
Capillary | Squalane | 74. | 1279.9 | Soják, Kraus, et al., 1982 | Column length: 62. m; Column diameter: 0.25 mm |
Capillary | Squalane | 100. | 1280. | Sojak, Hrivnak, et al., 1973 | |
Capillary | Squalane | 115. | 1280. | Sojak, Hrivnak, et al., 1973 | |
Capillary | Squalane | 130. | 1281. | Sojak, Hrivnak, et al., 1973 | |
Capillary | Squalane | 86. | 1280. | Sojak, Hrivnak, et al., 1973 |

Kovats' RI, polar column, isothermal

Column type | Active phase | Temperature (C) | I | Reference | Comment |
---|---|---|---|---|---|
Capillary | PEG-20M | 65. | 1323. | Rang, Orav, et al., 1988 | |
Capillary | PEG-20M | 65. | 1328. | Rang, Orav, et al., 1988 | |
Capillary | PEG-20M | 65. | 1328. | Rang, Orav, et al., 1988 | |
Capillary | PEG-20M | 65. | 1330. | Rang, Orav, et al., 1988 | |
Capillary | PEG-20M | 70. | 1324. | Rang, Orav, et al., 1988 | |
Capillary | PEG-20M | 70. | 1330. | Rang, Orav, et al., 1988 | |
Capillary | PEG-20M | 70. | 1330. | Rang, Orav, et al., 1988 | |
Capillary | PEG-20M | 80. | 1331. | Rang, Orav, et al., 1988 | |
Capillary | PEG 4000 | 100. | 1337. | Rang, Orav, et al., 1988 | |
Capillary | PEG 4000 | 110. | 1337. | Rang, Orav, et al., 1988 | |
Capillary | PEG 4000 | 120. | 1337. | Rang, Orav, et al., 1988 | |
Capillary | PEG 4000 | 140. | 1338. | Rang, Orav, et al., 1988 | |
Capillary | PEG 4000 | 160. | 1339. | Rang, Orav, et al., 1988 | |
Capillary | PEG-20M | 110. | 1332. | Rang, Orav, et al., 1988 | |
Capillary | PEG-20M | 120. | 1332. | Rang, Orav, et al., 1988 | |
Capillary | PEG-20M | 130. | 1333. | Rang, Orav, et al., 1988 | |
Capillary | PEG-20M | 140. | 1333. | Rang, Orav, et al., 1988 | |
Capillary | PEG-20M | 150. | 1334. | Rang, Orav, et al., 1988 | |
Capillary | PEG-20M | 160. | 1334. | Rang, Orav, et al., 1988 | |
Capillary | PEG-20M | 65. | 1322.4 | Orav, Kuningas, et al., 1985 | Column length: 100. m; Column diameter: 0.25 mm |
Capillary | PEG-20M | 65. | 1329.6 | Orav, Kuningas, et al., 1985 | Column length: 100. m; Column diameter: 0.25 mm |
Capillary | PEG-20M | 70. | 1323.7 | Orav, Kuningas, et al., 1985 | Column length: 100. m; Column diameter: 0.25 mm |
Capillary | PEG-20M | 70. | 1329.8 | Orav, Kuningas, et al., 1985 | Column length: 100. m; Column diameter: 0.25 mm |
Capillary | PEG-20M | 65. | 1319.1 | Orav, Kuningas, et al., 1985 | Column length: 50. m; Column diameter: 0.25 mm |
Capillary | PEG-20M | 65. | 1323.1 | Orav, Kuningas, et al., 1985 | Column length: 50. m; Column diameter: 0.25 mm |
Capillary | PEG-20M | 65. | 1328.1 | Orav, Kuningas, et al., 1985 | Column length: 50. m; Column diameter: 0.25 mm |
Capillary | PEG-20M | 65. | 1328.4 | Orav, Kuningas, et al., 1985 | Column length: 50. m; Column diameter: 0.25 mm |
Capillary | PEG-20M | 70. | 1320.8 | Orav, Kuningas, et al., 1985 | Column length: 50. m; Column diameter: 0.25 mm |
Capillary | PEG-20M | 70. | 1324.2 | Orav, Kuningas, et al., 1985 | Column length: 50. m; Column diameter: 0.25 mm |
Capillary | PEG-20M | 70. | 1330.2 | Orav, Kuningas, et al., 1985 | Column length: 50. m; Column diameter: 0.25 mm |
Capillary | PEG 4000 | 100. | 1337. | Rang, Kuningas, et al., 1977 | Column diameter: 0.25 mm |
Capillary | PEG 4000 | 120. | 1337. | Rang, Kuningas, et al., 1977 | Column diameter: 0.25 mm |
Capillary | PEG 4000 | 140. | 1338. | Rang, Kuningas, et al., 1977 | Column diameter: 0.25 mm |
Capillary | PEG 4000 | 160. | 1339. | Rang, Kuningas, et al., 1977 | Column diameter: 0.25 mm |

Normal alkane RI, non-polar column, custom temperature program

Column type | Active phase | I | Reference | Comment |
---|---|---|---|---|
Capillary | Polydimethyl siloxane | 1280. | Junkes, Castanho, et al., 2003 | Program: not specified |

References

Doering, Estel, et al., 1973
Doering, C.E.; Estel, D.; Fischer, R.; Baberowski, G.; Prinzler, H.,
Analysis of C13 olefins as epoxides by capillary gas chromatography,
Z. Chem., 1973, 13, 257-258. [all data]
Heinzen, Soares, et al., 1999
Heinzen, V.E.F.; Soares, M.F.; Yunes, R.A.,
Semi-empirical topological method for the prediction of the chromatographic retention of cis- and trans-alkene isomers and alkanes,
J. Chromatogr. A, 1999, 849, 2, 495-506, https://doi.org/10.1016/S0021-9673(99)00530-0
. [all data]
Rang, Kuningas, et al., 1987
Rang, S.; Kuningas, K.; Strenze, T.; Orav, A.; Eisen, O.,
Retention and Thermodynamics of Solution of n-Alkenes in OV-101,
J. Chromatogr., 1987, 406, 75-80, https://doi.org/10.1016/S0021-9673(00)94018-4
. [all data]
Soják, Kraus, et al., 1982
Soják, L.; Kraus, G.; Farkas, P.; Ostovský, I.,
Hochleistungs-gaschromatographie an flüssigkristall-glaskapillaren. V. Trennung von isomeren n-tridecenen und n-tetradecenen,
J. Chromatogr., 1982, 238, 1, 51-57, https://doi.org/10.1016/S0021-9673(00)82710-7
. [all data]
Sojak, Hrivnak, et al., 1973
Sojak, L.; Hrivnak, J.; Majer, P.; Janak, J.,
Capillary Gas Chromatography of Linear Alkenes on Squalane,
Anal. Chem., 1973, 45, 2, 293-302, https://doi.org/10.1021/ac60324a039
. [all data]
Rang, Orav, et al., 1988
Rang, S.A.; Orav, A.E.; Kuningas, K.R.; Meister, A.E.; Strense, T.V.; Eisen, O.G.,
Gas-Chromatographic Characteristics of unsaturated hydrocarbons, Academy of Sciences of Estonia SSR, Tallinn, Estonia SSR, 1988, 208. [all data]
Orav, Kuningas, et al., 1985
Orav, A.; Kuningas, K.; Rang, S.; Eisen, O.,
Capillary gas chromatography of n-tridecenes, n-tetradecenes and C10-C14 n-alkynes on polyethylene glycol 20m of different polarity,
Eesti NSV Tead. Akad. Toim. Keem., 1985, 34, 2, 105-113. [all data]
Rang, Kuningas, et al., 1977
Rang, S.; Kuningas, K.; Orav, A.; Eisen, O.,
Capillary Gas Chromatography of C6-C14 n-Alkenes on Polyphenyl Ether and Polyethylene Glycol 4000,
Chromatographia, 1977, 10, 2, 55-64, https://doi.org/10.1007/BF02274460
. [all data]
Junkes, Castanho, et al., 2003
Junkes, B.S.; Castanho, R.D.M.; Amboni, C.; Yunes, R.A.; Heinzen, V.E.F.,
Semiempirical Topological Index: A Novel Molecular Descriptor for Quantitative Structure-Retention Relationship Studies,
Internet Electronic Journal of Molecular Design, 2003, 2, 1, 33-49. [all data]