1,3-Dimethoxy-5-methyl-2-hexylbenzene
- Formula: C15H24O2
- Molecular weight: 236.3499
- CAS Registry Number: 41442-51-7

Phase change data

Data compiled by: William E. Acree, Jr., James S. Chickos
Enthalpy of vaporization
ΔvapH (kJ/mol) | Temperature (K) | Method | Reference | Comment |
---|---|---|---|---|
72.3 | 425. | A,GC | Stephenson and Malanowski, 1987 | Based on data from 410. to 475. K. See also Kundel, Lille, et al., 1975. |

References

Stephenson and Malanowski, 1987
Stephenson, Richard M.; Malanowski, Stanislaw,
Handbook of the Thermodynamics of Organic Compounds, 1987, https://doi.org/10.1007/978-94-009-3173-2
. [all data]
Kundel, Lille, et al., 1975
Kundel, H.; Lille, U.; Kaidas, N.,
Tr. Tallin. Politekh. Inst., 1975, 390, 107. [all data]