2H-Tetrazole, 2,5-dimethyl-
- Formula: C3H6N4
- Molecular weight: 98.1065
- IUPAC Standard InChIKey: HVRBCXZGTURXBT-UHFFFAOYSA-N
- CAS Registry Number: 4135-93-7
- Chemical structure:
View 3d structure (requires JavaScript / HTML 5) - Permanent link for this species. Use this link for bookmarking this species for future reference.

Gas phase thermochemistry data

Data compiled by: Hussein Y. Afeefy, Joel F. Liebman, and Stephen E. Stein
Quantity | Value | Units | Method | Reference | Comment |
---|---|---|---|---|---|
ΔfH°gas | 251.2 ± 2.9 | kJ/mol | Ccb | Kozyro, Simirskii, et al., 1990 |

Condensed phase thermochemistry data

Data compiled by: Hussein Y. Afeefy, Joel F. Liebman, and Stephen E. Stein
Quantity | Value | Units | Method | Reference | Comment |
---|---|---|---|---|---|
ΔfH°solid | 202.5 ± 2.9 | kJ/mol | Ccb | Kozyro, Simirskii, et al., 1990 | |
Quantity | Value | Units | Method | Reference | Comment |
ΔcH°solid | -2240.5 ± 2.8 | kJ/mol | Ccb | Kozyro, Simirskii, et al., 1990 |

Phase change data

Data compiled as indicated in comments:
TRC - Thermodynamics Research Center, NIST Boulder Laboratories, Chris Muzny director
ALS - Hussein Y. Afeefy, Joel F. Liebman, and Stephen E. Stein
DRB - Donald R. Burgess, Jr.
AC - William E. Acree, Jr., James S. Chickos
Quantity | Value | Units | Method | Reference | Comment |
---|---|---|---|---|---|
Ttriple | 257. | K | N/A | Kozyro, Simirskii, et al., 1990, 2 | Uncertainty assigned by TRC = 1. K; Det. with triple heat bridge; TRC |
Quantity | Value | Units | Method | Reference | Comment |
ΔsubH° | 48.7 ± 0.5 | kJ/mol | V | Kozyro, Simirskii, et al., 1990 | ALS |
ΔsubH° | 48.7 | kJ/mol | N/A | Kozyro, Simirskii, et al., 1990 | DRB |
Enthalpy of fusion
ΔfusH (kJ/mol) | Temperature (K) | Reference | Comment |
---|---|---|---|
13.5 | 256.4 | Kozyro, Simirskii, et al., 1990, 3 | AC |

References

Kozyro, Simirskii, et al., 1990
Kozyro, A.A.; Simirskii, V.V.; Krasulin, A.P.; Sevruk, V.M.; Kabo, G.Ya.; Frenkel, M.L.; Gaponik, P.N.; Grigor'ev, Yu.V.,
Thermodynamic properties of tetrazole derivatives in different aggregation states,
Russ. J. Phys. Chem. (Engl. Transl.), 1990, 64, 348-350. [all data]
Kozyro, Simirskii, et al., 1990, 2
Kozyro, A.A.; Simirskii, V.V.; Kabo, G.Y.; Frenkel, M.L.; Krasulin, A.P.; Sevruk, V.M.; Sokolov, N.A.,
Additivity of the thermochemical characteristics of tetraalklyl-substituted carbamides,
Zh. Fiz. Khim., 1990, 64, 2360. [all data]
Kozyro, Simirskii, et al., 1990, 3
Kozyro, A.A.; Simirskii, V.V.; Krasulin, A.P.; Sevruk, V.M.; Kabo, G.Y.; Frenkel, M.L.; Gaponik, P.N.; Grigor'ev, Y.V.,
Thermodynamic properties of tetrazole derivatives in different aggregation states,
Zh. Fiz. Khim., 1990, 64, 656. [all data]