Phenol, 2,6-bis(1,1-dimethylethyl)-4-ethyl-
- Formula: C16H26O
- Molecular weight: 234.3770
- IUPAC Standard InChIKey: BVUXDWXKPROUDO-UHFFFAOYSA-N
- CAS Registry Number: 4130-42-1
- Chemical structure:
View 3d structure (requires JavaScript / HTML 5) - Other names: Phenol, 2,6-di-tert-butyl-4-ethyl-; Ionol 2; 2,6-Di-tert-butyl-4-ethylphenol; 2,6-di-t-Butyl-4-ethylphenol; 1-Hydroxy-4-ethyl-2,6-di-tert-butylbenzene; 2,6-Bis(1,1-dimethylethyl)-4-ethylphenol; 4-Ethyl-2,6-di-tert-butylphenol; Yoshinox 250; Nocrac M 17; Sandant 425; NSC 14453; Phenol, 2,6-bis-(1.1-dimethylethyl)-4-ethyl

Phase change data

Data compiled as indicated in comments:
AC - William E. Acree, Jr., James S. Chickos
Enthalpy of vaporization
ΔvapH (kJ/mol) | Temperature (K) | Reference | Comment |
---|---|---|---|
62.8 | 348. | Stage, Müller, et al., 1953 | Based on data from 362. to 557. K.; AC |
60.4 | 373. | Stage, Müller, et al., 1953 | Based on data from 362. to 557. K.; AC |
58.6 | 398. | Stage, Müller, et al., 1953 | Based on data from 362. to 557. K.; AC |
57.3 | 423. | Stage, Müller, et al., 1953 | Based on data from 362. to 557. K.; AC |
52.6 | 473. | Stage, Müller, et al., 1953 | Based on data from 362. to 557. K.; AC |
Antoine Equation Parameters
log10(P) = A − (B / (T + C))
P = vapor pressure (bar)
T = temperature (K)
View plot Requires a JavaScript / HTML 5 canvas capable browser.
Temperature (K) | A | B | C | Reference | Comment |
---|---|---|---|---|---|
362.3 to 541.8 | 6.33499 | 3626.949 | 31.535 | Stull, 1947 | Coefficents calculated by NIST from author's data. |

Van Den Dool and Kratz RI, non-polar column, temperature ramp

Column type | Active phase | I | Reference | Comment |
---|---|---|---|---|
Capillary | DB-5 | 1760. | Gómez, Ledbetter, et al., 1993 | He, 4. K/min; Column length: 30. m; Column diameter: 0.25 mm; Tstart: 50. C; Tend: 250. C |

Normal alkane RI, non-polar column, custom temperature program

Column type | Active phase | I | Reference | Comment |
---|---|---|---|---|
Capillary | TR-5 MS | 1747. | Kurashov, Mitrukova, et al., 2014 | 15. m/0.25 mm/0.25 μm, Helium; Program: 35 0C (3 min) 2 0C/min -> 60 0C (3 min) 2 0C/min -> 80 0C (3 min) 4 0C/min -> 120 0C (3 min) 5 0C/min -> 150 0C (3 min) 15 0C/min -> 240 0C (10 min) |

References

Stage, Müller, et al., 1953
Stage, H.; Müller, E.; Faldix, P.,
Erdol u Kohle, 1953, 6, 375. [all data]
Stull, 1947
Stull, Daniel R.,
Vapor Pressure of Pure Substances. Organic and Inorganic Compounds,
Ind. Eng. Chem., 1947, 39, 4, 517-540, https://doi.org/10.1021/ie50448a022
. [all data]
(editor), 1983
(editor), Koptyug V.A.,
Atlas of Spectra of Aromatic and Heterocyclic Compounds, 1983, 25, 16. [all data]
Gómez, Ledbetter, et al., 1993
Gómez, E.; Ledbetter, C.A.; Hartsell, P.L.,
Volatile compounds in apricot, plum, and their interspecific hybrids,
J. Agric. Food Chem., 1993, 41, 10, 1669-1676, https://doi.org/10.1021/jf00034a029
. [all data]
Kurashov, Mitrukova, et al., 2014
Kurashov, E.A.; Mitrukova, G.G.; Krylova, Yu.V.,
Variations in the component composition of essential oil of Ceratophyllum demersum (Ceratophyllaceae) during vegetation (in press),
Plant Resources (Rastitel'nye Resursy), 2014, 1, 000-000. [all data]