Cyclopropane, 1,1,2,2-tetramethyl-
- Formula: C7H14
- Molecular weight: 98.1861
- IUPAC Standard InChIKey: JCHUCGKEGUAHEH-UHFFFAOYSA-N
- CAS Registry Number: 4127-47-3
- Chemical structure:
View 3d structure (requires JavaScript / HTML 5) - Other names: 1,1,2,2-Tetramethylcyclopropane

Condensed phase thermochemistry data

Data compiled by: Hussein Y. Afeefy, Joel F. Liebman, and Stephen E. Stein
Quantity | Value | Units | Method | Reference | Comment |
---|---|---|---|---|---|
ΔfH°liquid | -119.8 ± 0.92 | kJ/mol | Ccb | Good, 1971 | |
Quantity | Value | Units | Method | Reference | Comment |
ΔcH°liquid | -4635.62 ± 0.84 | kJ/mol | Ccb | Good, 1971 | Corresponding ΔfHºliquid = -119.7 kJ/mol (simple calculation by NIST; no Washburn corrections) |

Phase change data

Data compiled by: Thermodynamics Research Center, NIST Boulder Laboratories, Chris Muzny director
Quantity | Value | Units | Method | Reference | Comment |
---|---|---|---|---|---|
Tboil | 349. | K | N/A | Kelso, Greenlee, et al., 1955 | Uncertainty assigned by TRC = 0.2 K |
Tboil | 349. | K | N/A | Anonymous, 1951 | Uncertainty assigned by TRC = 0.2 K |
Tboil | 349. | K | N/A | Boord, Greenlee, et al., 1950 | Uncertainty assigned by TRC = 0.3 K |
Tboil | 349. | K | N/A | Boord, Greenlee, et al., 1950 | Uncertainty assigned by TRC = 0.3 K |
Tboil | 349.04 | K | N/A | Anonymous, 1948 | Uncertainty assigned by TRC = 0.3 K |
Quantity | Value | Units | Method | Reference | Comment |
Tfus | 192.4 ± 0.2 | K | AVG | N/A | Average of 10 values; Individual data points |

Kovats' RI, non-polar column, isothermal

Column type | Active phase | Temperature (C) | I | Reference | Comment |
---|---|---|---|---|---|
Packed | Squalane | 27. | 618. | Bogoslovsky, Anvaer, et al., 1978 | |
Packed | Squalane | 50. | 621. | Bogoslovsky, Anvaer, et al., 1978 | |
Packed | Squalane | 60. | 621. | Bogoslovsky, Anvaer, et al., 1978 | |
Packed | Squalane | 67. | 621. | Bogoslovsky, Anvaer, et al., 1978 | |
Packed | Squalane | 86. | 622. | Bogoslovsky, Anvaer, et al., 1978 | |
Capillary | Squalane | 50. | 620. | Rijks and Cramers, 1974 | N2; Column length: 100. m; Column diameter: 0.25 mm |
Capillary | Squalane | 70. | 622. | Rijks and Cramers, 1974 | N2; Column length: 100. m; Column diameter: 0.25 mm |
Capillary | Squalane | 60. | 621.2 | Schomburg and Dielmann, 1973 | Column length: 100. m; Column diameter: 0.25 mm |
Packed | Squalane | 27. | 618. | Hively and Hinton, 1968 | He, Chromosorb P; Column length: 15. m; Column diameter: 0.25 mm |
Packed | Squalane | 49. | 621. | Hively and Hinton, 1968 | He, Chromosorb P; Column length: 15. m; Column diameter: 0.25 mm |
Packed | Squalane | 67. | 622. | Hively and Hinton, 1968 | He, Chromosorb P; Column length: 15. m; Column diameter: 0.25 mm |

Normal alkane RI, non-polar column, custom temperature program

Column type | Active phase | I | Reference | Comment |
---|---|---|---|---|
Capillary | Squalane | 621. | Chen, 2008 | Program: not specified |
Capillary | Polydimethyl siloxanes | 625. | Zenkevich, Chupalov, et al., 1996 | Program: not specified |

References

Good, 1971
Good, W.D.,
The enthalpies of combustion and formation of some alkyl cyclopropanes,
J. Chem. Thermodyn., 1971, 3, 539-546. [all data]
Kelso, Greenlee, et al., 1955
Kelso, R.G.; Greenlee, K.W.; Derfer, J.M.; Boord, C.E.,
The Synthesis, Purification and Properties of Some Polyalkylcyclo- propanes: Reduction of α,.gama.-Dibromides,
J. Am. Chem. Soc., 1955, 77, 1751-5. [all data]
Anonymous, 1951
Anonymous, R.,
, Sunbury Rep. No. 4199, Anglo-Iranian Oil Co., 1951. [all data]
Boord, Greenlee, et al., 1950
Boord, C.E.; Greenlee, K.W.; Derfer, J.M.,
The Synthesis, Purification and Prop. of Hydrocarbons of Low Mol. Wt., Am. Pet. Inst. Res. Proj. 45, Twelfth Annu. Rep., Ohio State Univ., 1950. [all data]
Anonymous, 1948
Anonymous, R.,
, Am. Pet. Inst. Res. Proj. 6, Natl. Bur. Stand., 1948. [all data]
Bogoslovsky, Anvaer, et al., 1978
Bogoslovsky, Yu.N.; Anvaer, B.I.; Vigdergauz, M.S.,
Chromatographic constants in gas chromatography (in Russian), Standards Publ. House, Moscow, 1978, 192. [all data]
Rijks and Cramers, 1974
Rijks, J.A.; Cramers, C.A.,
High precision capillary gas chromatography of hydrocarbons,
Chromatographia, 1974, 7, 3, 99-106, https://doi.org/10.1007/BF02269819
. [all data]
Schomburg and Dielmann, 1973
Schomburg, G.; Dielmann, G.,
Use of retention increments for identification and correlation of saturated and unsaturated cyclopropane hydrocarbons by means of Kovats indices,
Anal. Chem., 1973, 45, 9, 1647-1658, https://doi.org/10.1021/ac60331a021
. [all data]
Hively and Hinton, 1968
Hively, R.A.; Hinton, R.E.,
Variation of the retention index with temperature on squalane substrates,
J. Gas Chromatogr., 1968, 6, 4, 203-217, https://doi.org/10.1093/chromsci/6.4.203
. [all data]
Chen, 2008
Chen, H.-F.,
Quantitative prediction of gas chromatography retention indices with support vector machines, radial basis neutral networks and multiple linear regression,
Anal. Chim. Acta, 2008, 609, 1, 24-36, https://doi.org/10.1016/j.aca.2008.01.003
. [all data]
Zenkevich, Chupalov, et al., 1996
Zenkevich, I.G.; Chupalov, A.A.; Herzschuh, R.,
Correlation of the Increments of Gas Chromatographic Retention Indices with the Differences of Innermolecular Energies of Reagents and Products of Chemical Reactions,
Zh. Org. Khim. (Rus.), 1996, 32, 11, 1685-1691. [all data]