Dichloroacetic anhydride
- Formula: C4H2Cl4O3
- Molecular weight: 239.869
- IUPAC Standard InChIKey: RQHMQURGSQBBJY-UHFFFAOYSA-N
- CAS Registry Number: 4124-30-5
- Chemical structure:
View 3d structure (requires JavaScript / HTML 5) - Other names: Dichloroacetetic anhydride; Acetic acid, dichloro-, anhydride; Dichloroacetic acid anhydride; Anhydrid kyseliny dichloroctove; 2,2'-dichloroacetic anhydride

Phase change data

Data compiled by: Robert L. Brown and Stephen E. Stein
Quantity | Value | Units | Method | Reference | Comment |
---|---|---|---|---|---|
Tboil | 488.2 | K | N/A | Aldrich Chemical Company Inc., 1990 |

Normal alkane RI, non-polar column, custom temperature program

Column type | Active phase | I | Reference | Comment |
---|---|---|---|---|
Capillary | Polydimethyl siloxanes | 1248. | Zenkevich, 2001 | Program: not specified |

References

Aldrich Chemical Company Inc., 1990
Aldrich Chemical Company Inc.,
Catalog Handbook of Fine Chemicals, Aldrich Chemical Company, Inc., Milwaukee WI, 1990, 1. [all data]
Zenkevich, 2001
Zenkevich, I.G.,
Encyclopedia of Chromatography. Derivatization of Amines, Amino Acids, Amides and Imides for GC Analysis, Marcel Dekker, Inc, New York - Basel, 2001, 224. [all data]