1,1-Propanediol, 2-methyl-
- Formula: C4H10O2
- Molecular weight: 90.1210
- IUPAC Standard InChIKey: QOFLTGDAZLWRMJ-UHFFFAOYSA-N
- CAS Registry Number: 41240-66-8
- Chemical structure:
View 3d structure (requires JavaScript / HTML 5) - Permanent link for this species. Use this link for bookmarking this species for future reference.

Reaction thermochemistry data

Data compiled by: Hussein Y. Afeefy, Joel F. Liebman, and Stephen E. Stein
Individual Reactions
By formula: H2O + C4H8O = C4H10O2
Quantity | Value | Units | Method | Reference | Comment |
---|---|---|---|---|---|
ΔrH° | -23. | kJ/mol | Eqk | Green and Hine, 1973 | liquid phase |

References

Green and Hine, 1973
Green, L.R.; Hine, J.,
Isobutyraldehyde. The kinetics of acid- and base-catalyzed equilibrations in water,
J. Org. Chem., 1973, 38, 2801-28. [all data]