2,5-Dimethyl-(E)-1,3,5-hexatriene
- Formula: C8H12
- Molecular weight: 108.1809
- IUPAC Standard InChIKey: ZVFFWOKVVPSTAL-AATRIKPKSA-N
- CAS Registry Number: 41233-74-3
- Chemical structure:
View 3d structure (requires JavaScript / HTML 5) - Stereoisomers:

Gas phase thermochemistry data

Data compiled by: Hussein Y. Afeefy, Joel F. Liebman, and Stephen E. Stein
Quantity | Value | Units | Method | Reference | Comment |
---|---|---|---|---|---|
ΔfH°gas | 95.8 | kJ/mol | Chyd | Roth, Adamczak, et al., 1991 |

Reaction thermochemistry data

Data compiled by: Hussein Y. Afeefy, Joel F. Liebman, and Stephen E. Stein
Individual Reactions
By formula: 3H2 + C8H12 = C8H18
Quantity | Value | Units | Method | Reference | Comment |
---|---|---|---|---|---|
ΔrH° | -318. ± 0.4 | kJ/mol | Chyd | Roth, Adamczak, et al., 1991 | liquid phase |

References

Roth, Adamczak, et al., 1991
Roth, W.R.; Adamczak, O.; Breuckmann, R.; Lennartz, H.-W.; Boese, R.,
Die Berechnung von Resonanzenergien; das MM2ERW-Kraftfeld,
Chem. Ber., 1991, 124, 2499-2521. [all data]