hexadecyl methanoate

Phase change data

Data compiled by: Thermodynamics Research Center, NIST Boulder Laboratories, Chris Muzny director

Quantity Value Units Method Reference Comment
Tboil583.KN/ACarey and Smith, 1933Uncertainty assigned by TRC = 4. K
Quantity Value Units Method Reference Comment
Tfus295.9KN/ACarey and Smith, 1933Metastable crystal phase; Uncertainty assigned by TRC = 1. K
Tfus298.KN/ACarey and Smith, 1933Crystal phase 1 phase; Uncertainty assigned by TRC = 2. K

In addition to the Thermodynamics Research Center (TRC) data available from this site, much more physical and chemical property data is available from the following TRC products:

References

Carey and Smith, 1933
Carey, P.C.; Smith, J.C., Higher aliphatic compounds: part III the preparation of paraffins, J. Chem. Soc., 1933, 1933, 346-7. [all data]