Octane, 3,3-dimethyl-
- Formula: C10H22
- Molecular weight: 142.2817
- IUPAC Standard InChIKey: DBULLUBYDONGLT-UHFFFAOYSA-N
- CAS Registry Number: 4110-44-5
- Chemical structure:
View 3d structure (requires JavaScript / HTML 5) - Other names: 3,3-Dimethyloctane

Phase change data

Data compiled as indicated in comments:
TRC - Thermodynamics Research Center, NIST Boulder Laboratories, Chris Muzny director
AC - William E. Acree, Jr., James S. Chickos
Quantity | Value | Units | Method | Reference | Comment |
---|---|---|---|---|---|
Tboil | 434.35 | K | N/A | Kinney and Spliethoff, 1949 | Uncertainty assigned by TRC = 1. K; TRC |
Tboil | 429.15 | K | N/A | Levene and Marker, 1932 | Uncertainty assigned by TRC = 4. K; TRC |
Quantity | Value | Units | Method | Reference | Comment |
ΔvapH° | 48.5 | kJ/mol | N/A | Reid, 1972 | AC |

Henry's Law data

Data compiled by: Rolf Sander
Henry's Law constant (water solution)
kH(T) = k°H exp(d(ln(kH))/d(1/T) ((1/T) - 1/(298.15 K)))
k°H = Henry's law constant for solubility in water at 298.15 K (mol/(kg*bar))
d(ln(kH))/d(1/T) = Temperature dependence constant (K)
k°H (mol/(kg*bar)) | d(ln(kH))/d(1/T) (K) | Method | Reference | Comment |
---|---|---|---|---|
0.00015 | Q | N/A | missing citation give several references for the Henry's law constants but don't assign them to specific species. |

Kovats' RI, non-polar column, isothermal

Data compiled by: NIST Mass Spectrometry Data Center, William E. Wallace, director

Column type CapillaryCapillaryCapillaryCapillaryCapillary
Active phase SqualaneOV-101OV-101OV-101DB-1
Column length (m)     60.
Carrier gas
Substrate
Column diameter (mm)     0.264
Phase thickness (μm)
Temperature (C) 100.40.60.80.60.
I 932.939.940.943.935.5
ReferenceHeinzen, Soares, et al., 1999Laub and Purnell, 1988Laub and Purnell, 1988Laub and Purnell, 1988Lubeck and Sutton, 1983
Comment MSDC-RI MSDC-RI MSDC-RI MSDC-RI MSDC-RI
Column type CapillaryCapillaryCapillary
Active phase DB-1SqualaneSqualane
Column length (m) 60. 91.4
Carrier gas   N2
Substrate
Column diameter (mm) 0.259 0.25
Phase thickness (μm) 1.
Temperature (C) 60.60.60.
I 935.5932.932.
ReferenceLubeck and Sutton, 1983Chretien and Dubois, 1976Matukuma, 1969
Comment MSDC-RI MSDC-RI MSDC-RI

References

Kinney and Spliethoff, 1949
Kinney, C.R.; Spliethoff, W.L.,
A System of Correlating Molecular Structure of Organic Compounds with Boiling Points VII. New Boiling Pts. for Certain Paraffins and Olefins,
J. Org. Chem., 1949, 14, 71. [all data]
Levene and Marker, 1932
Levene, P.A.; Marker, R.E.,
J. Biol. Chem., 1932, 95, 1. [all data]
Reid, 1972
Reid, Robert C.,
Handbook on vapor pressure and heats of vaporization of hydrocarbons and related compounds, R. C. Wilhort and B. J. Zwolinski, Texas A Research Foundation. College Station, Texas(1971). 329 pages.$10.00,
AIChE J., 1972, 18, 6, 1278-1278, https://doi.org/10.1002/aic.690180637
. [all data]