1,4-Di(methyl-d3)benzene-d4
- Formula: C8D10
- Molecular weight: 116.2266
- IUPAC Standard InChIKey: URLKBWYHVLBVBO-ZGYYUIRESA-N
- CAS Registry Number: 41051-88-1
- Chemical structure:
- Other names: Benzene-1,2,4,5-d4-, 3,6-di(methyl-d3)-; [2H10]-1,4-Dimethylbenzene; p-Xylene-d10; (2H10)-p-xylene

Phase change data

Data compiled by: William E. Acree, Jr., James S. Chickos
Quantity | Value | Units | Method | Reference | Comment |
---|---|---|---|---|---|
ΔvapH° | 10.1 | kcal/mol | CGC | Zhao, Unhannanant, et al., 2008 |

Kovats' RI, non-polar column, isothermal

Column type | Active phase | Temperature (C) | I | Reference | Comment |
---|---|---|---|---|---|
Capillary | SE-54 | 115. | 880. | Bermejo, Blanco, et al., 1986 | N2; Column length: 25. m; Column diameter: 0.22 mm |
Capillary | Squalane | 115. | 858. | Bermejo, Blanco, et al., 1986 | N2; Column length: 45. m; Column diameter: 0.5 mm |

References

Zhao, Unhannanant, et al., 2008
Zhao, Hui; Unhannanant, Patamaporn; Hanshaw, William; Chickos, James S.,
Enthalpies of Vaporization and Vapor Pressures of Some Deuterated Hydrocarbons. Liquid-Vapor Pressure Isotope Effects,
J. Chem. Eng. Data, 2008, 53, 7, 1545-1556, https://doi.org/10.1021/je800091s
. [all data]
Bermejo, Blanco, et al., 1986
Bermejo, J.; Blanco, C.G.; Guillén, M.D.,
Gas chromatography of deuterated and protiated chloro derivatives of 1,4-dimethylbenzene,
J. Chromatogr., 1986, 351, 425-432, https://doi.org/10.1016/S0021-9673(01)83520-2
. [all data]