2-methylbutane-1,2-diol
- Formula: C5H12O2
- Molecular weight: 104.1476
- IUPAC Standard InChIKey: DOPZLYNWNJHAOS-UHFFFAOYSA-N
- CAS Registry Number: 41051-72-3
- Chemical structure:
View 3d structure (requires JavaScript / HTML 5) - Other names: 2-methyl-1,2-butanediol

Phase change data

Data compiled by: Thermodynamics Research Center, NIST Boulder Laboratories, Chris Muzny director
Quantity | Value | Units | Method | Reference | Comment |
---|---|---|---|---|---|
Tboil | 463.15 | K | N/A | Henry, 1906 | Uncertainty assigned by TRC = 3. K |
Tboil | 460.15 | K | N/A | Wagner, 1888 | Uncertainty assigned by TRC = 5. K |

References

Henry, 1906
Henry, L.,
C. R. Hebd. Seances Acad. Sci., 1906, 144, 1404. [all data]
Wagner, 1888
Wagner, G.,
Chem. Ber., 1888, 21, 1230. [all data]