1-Butanamine, N,3-dimethyl-
- Formula: C6H15N
- Molecular weight: 101.1900
- IUPAC Standard InChIKey: QSOCODZVGPDGDA-UHFFFAOYSA-N
- CAS Registry Number: 4104-44-3
- Chemical structure:
View 3d structure (requires JavaScript / HTML 5) - Other names: Butylamine, N,3-dimethyl-; N-Methylisoamylamine; N-Methylisopentylamine; Methyl isopentyl amine; isoamylmethyl-amine

Phase change data

Data compiled by: Thermodynamics Research Center, NIST Boulder Laboratories, Chris Muzny director
Quantity | Value | Units | Method | Reference | Comment |
---|---|---|---|---|---|
Tboil | 382.15 | K | N/A | Loffler, 1910 | Uncertainty assigned by TRC = 3. K |
Tboil | 368.15 | K | N/A | Clarke, 1905 | Uncertainty assigned by TRC = 3. K |
Tboil | 381.15 | K | N/A | Stoermer and von Lepel, 1896 | Uncertainty assigned by TRC = 4. K |

Kovats' RI, non-polar column, isothermal

Column type | Active phase | Temperature (C) | I | Reference | Comment |
---|---|---|---|---|---|
Packed | Apiezon L | 100. | 751. | Golovnya, Zhuravleva, et al., 1981 | N2, Chromosorb GAW; Column length: 2.7 m |

Normal alkane RI, non-polar column, custom temperature program

Column type | Active phase | I | Reference | Comment |
---|---|---|---|---|
Capillary | Methyl Silicone | 751. | Zenkevich, 1999 | Program: not specified |

References

Loffler, 1910
Loffler, K.,
A New Synthesis of N-Alkyl Pyrrolidines,
Chem. Ber., 1910, 43, 2035. [all data]
Clarke, 1905
Clarke, L.,
Am. Chem. J., 1905, 33, 496. [all data]
Stoermer and von Lepel, 1896
Stoermer; von Lepel,
Chem. Ber., 1896, 29, 2110. [all data]
Golovnya, Zhuravleva, et al., 1981
Golovnya, R.V.; Zhuravleva, I.L.; Svetlova, N.I.; Grigor'eva, D.N.; Terenina, M.B.; Gutnik, S.B.,
Gas-chromatographic behavior of secondary isoaliphatic and alicyclic amines,
J. Anal. Chem. USSR (Engl. Transl.), 1981, 36, 4, 501-505. [all data]
Zenkevich, 1999
Zenkevich, I.G.,
Dependence of Gas Chromatographic Retention Indices on Dynamics Molecular Characteristics,
Zh. Fiz. Khim., 1999, 73, 5, 905-910. [all data]