Quinoline, 6-methoxy-4-methyl-

Phase change data

Data compiled by: Thermodynamics Research Center, NIST Boulder Laboratories, Chris Muzny director

Quantity Value Units Method Reference Comment
Tfus303.KN/ACampbell and Schaffner, 1945Uncertainty assigned by TRC = 4. K

In addition to the Thermodynamics Research Center (TRC) data available from this site, much more physical and chemical property data is available from the following TRC products:

References

Campbell and Schaffner, 1945
Campbell, K.N.; Schaffner, I.J., The Preparation of 4-Methylquinolines, J. Am. Chem. Soc., 1945, 67, 86. [all data]