2,5-Furandione, dihydro-3-methyl-
- Formula: C5H6O3
- Molecular weight: 114.0993
- IUPAC Standard InChIKey: DFATXMYLKPCSCX-UHFFFAOYSA-N
- CAS Registry Number: 4100-80-5
- Chemical structure:
View 3d structure (requires JavaScript / HTML 5) - Other names: Succinic anhydride, methyl-; Methylsuccinic anhydride; Pyrotartaric anhydride; 2-Methylsuccinic anhydride; 3-Methylsuccinic anhydride; 3,4-Dihydro-3-methyl-2,5-furandione; 3-Methyldihydro-2,5-furandione

Condensed phase thermochemistry data

Data compiled by: Hussein Y. Afeefy, Joel F. Liebman, and Stephen E. Stein
Quantity | Value | Units | Method | Reference | Comment |
---|---|---|---|---|---|
ΔcH°liquid | -2213.8 ± 1.1 | kJ/mol | Ccb | Verkade and Hartman, 1933 | Reanalyzed by Cox and Pilcher, 1970, Original value = -2217. kJ/mol; At 288 K; Corresponding ΔfHºliquid = -611.24 kJ/mol (simple calculation by NIST; no Washburn corrections) |
Quantity | Value | Units | Method | Reference | Comment |
ΔcH°solid | -2205.1 ± 1.1 | kJ/mol | Ccb | Verkade and Hartman, 1933 | Reanalyzed by Cox and Pilcher, 1970, Original value = -2208. kJ/mol; At 288 K; Corresponding ΔfHºsolid = -619.99 kJ/mol (simple calculation by NIST; no Washburn corrections) |

Phase change data

Data compiled as indicated in comments:
BS - Robert L. Brown and Stephen E. Stein
TRC - Thermodynamics Research Center, NIST Boulder Laboratories, Chris Muzny director
AC - William E. Acree, Jr., James S. Chickos
Quantity | Value | Units | Method | Reference | Comment |
---|---|---|---|---|---|
Tboil | 512.2 | K | N/A | Weast and Grasselli, 1989 | BS |
Quantity | Value | Units | Method | Reference | Comment |
Tfus | 309.85 | K | N/A | Michelotti, Knuth, et al., 1959 | Uncertainty assigned by TRC = 1. K; TRC |
Enthalpy of vaporization
ΔvapH (kJ/mol) | Temperature (K) | Method | Reference | Comment |
---|---|---|---|---|
59.3 | 357. | A | Stephenson and Malanowski, 1987 | Based on data from 342. to 521. K. See also Stull, 1947.; AC |
Antoine Equation Parameters
log10(P) = A − (B / (T + C))
P = vapor pressure (bar)
T = temperature (K)
View plot Requires a JavaScript / HTML 5 canvas capable browser.
Temperature (K) | A | B | C | Reference | Comment |
---|---|---|---|---|---|
342.8 to 520.6 | 4.79405 | 2259.765 | -48.372 | Stull, 1947 | Coefficents calculated by NIST from author's data. |

Reaction thermochemistry data

Data compiled by: Hussein Y. Afeefy, Joel F. Liebman, and Stephen E. Stein
Individual Reactions
By formula: C5H6O3 + H2O = C5H8O4
Quantity | Value | Units | Method | Reference | Comment |
---|---|---|---|---|---|
ΔrH° | -54.9 ± 0.2 | kJ/mol | Cm | Conn, Kistiakowsky, et al., 1942 | liquid phase; Heat of hydrolysis at 303 K |

Normal alkane RI, polar column, temperature ramp

Column type | Active phase | I | Reference | Comment |
---|---|---|---|---|
Capillary | DB-Wax | 1855. | Pfannhauser, 1990 | 30, 30. C @ 10. min, 50. K/min; Column diameter: 0.25 mm; Tend: 240. C |

References

Verkade and Hartman, 1933
Verkade, P.E.; Hartman, H.,
Calorimetric researches XXI. Heats of combustion of methyl-, ethyl- and phenyl-substituted succinic acids and of their anhydrides: a. Experimental data,
Rec. Trav. Chim. Pays/Bas, 1933, 52, 945-968. [all data]
Cox and Pilcher, 1970
Cox, J.D.; Pilcher, G.,
Thermochemistry of Organic and Organometallic Compounds, Academic Press, New York, 1970, 1-636. [all data]
Weast and Grasselli, 1989
CRC Handbook of Data on Organic Compounds, 2nd Editon, Weast,R.C and Grasselli, J.G., ed(s)., CRC Press, Inc., Boca Raton, FL, 1989, 1. [all data]
Michelotti, Knuth, et al., 1959
Michelotti, F.W.; Knuth, C.J.; Bavley, A.,
Some Anhydride Curing Agents for Epoxy Resins,
J. Chem. Eng. Data, 1959, 4, 79. [all data]
Stephenson and Malanowski, 1987
Stephenson, Richard M.; Malanowski, Stanislaw,
Handbook of the Thermodynamics of Organic Compounds, 1987, https://doi.org/10.1007/978-94-009-3173-2
. [all data]
Stull, 1947
Stull, Daniel R.,
Vapor Pressure of Pure Substances. Organic and Inorganic Compounds,
Ind. Eng. Chem., 1947, 39, 4, 517-540, https://doi.org/10.1021/ie50448a022
. [all data]
Conn, Kistiakowsky, et al., 1942
Conn, J.B.; Kistiakowsky, G.B.; Roberts, R.M.; Smith, E.A.,
Heats of organic reactions. XIII. Heats of hydrolysis of some acid anhydrides,
J. Am. Chem. Soc., 1942, 64, 1747-17. [all data]
Pfannhauser, 1990
Pfannhauser, W.,
Fluchtige Verbindungen aus extrudaten von triticale,
Deutsche Lebensmittel-Rundschau, 1990, 86, 3, 69-72. [all data]