Oxazole, 2,5-diethyl
- Formula: C7H11NO
- Molecular weight: 125.1683
- IUPAC Standard InChIKey: IQWHXRKZJXFLTB-UHFFFAOYSA-N
- CAS Registry Number: 40953-14-8
- Chemical structure:
View 3d structure (requires JavaScript / HTML 5) - Other names: 2,5-diethyloxazole

Kovats' RI, non-polar column, isothermal

Column type | Active phase | Temperature (C) | I | Reference | Comment |
---|---|---|---|---|---|
Capillary | OV-101 | 110. | 903. | Golovnya, Zhuravleva, et al., 1991 | 50. m/0.30 mm/0.4 μm, He |
Capillary | OV-101 | 110. | 940. | Zhuravleva, Shenderyuk, et al., 1990 | 50. m/0.30 mm/0.40 μm, He |
Capillary | OV-101 | 110. | 940. | Golovnya, Shenderyuk, et al., 1989 | 40. m/0.28 mm/0.40 μm, He |

Kovats' RI, polar column, isothermal

Column type | Active phase | Temperature (C) | I | Reference | Comment |
---|---|---|---|---|---|
Capillary | PEG-40M | 110. | 1279. | Golovnya, Shenderyuk, et al., 1991 | He; Column length: 50. m; Column diameter: 0.30 mm |
Capillary | PEG-40M | 110. | 1279. | Zhuravleva, Shenderyuk, et al., 1990 | 50. m/0.30 mm/0.40 μm, He |
Capillary | PEG-40M | 110. | 1279. | Golovnya, Shenderyuk, et al., 1989 | 47. m/0.30 mm/0.40 μm, He |

Normal alkane RI, non-polar column, temperature ramp

Column type | Active phase | I | Reference | Comment |
---|---|---|---|---|
Capillary | Methyl Silicone | 909. | Lorenz, Stern, et al., 1983 | 4. K/min, 200. C @ 15. min; Column length: 25. m; Column diameter: 0.2 mm; Tstart: 50. C |

References

Golovnya, Zhuravleva, et al., 1991
Golovnya, R.V.; Zhuravleva, I.L.; Yakush, E.V.; Schenderjuk, V.V.,
Retentions of alkyloxazoles and alkythiazoles and their prediction based on non-linear additivity concepts in gas chromatography,
J. Chromatogr., 1991, 552, 1-12, https://doi.org/10.1016/S0021-9673(01)95918-7
. [all data]
Zhuravleva, Shenderyuk, et al., 1990
Zhuravleva, I.L.; Shenderyuk, V.V.; Yakush, E.V.; Golovnya, R.V.,
Calculation of retention indexes of alkyloxazoles and alkylthiazoles in capillary chromatography,
Bull. Acad. Sci. USSR, Div. Chem. Sci. (Engl. Transl.), 1990, 6, 6, 1204-1210, https://doi.org/10.1007/BF00962384
. [all data]
Golovnya, Shenderyuk, et al., 1989
Golovnya, R.V.; Shenderyuk, V.V.; Zhuravleva, I.L.; Yakush, E.V.,
Use of a principle of non-additivity of sorption energies for calculation of retention indices of alkyloxazoles in capillary chromatography,
Zh. Anal. Khim., 1989, 44, 2037-2042. [all data]
Golovnya, Shenderyuk, et al., 1991
Golovnya, R.V.; Shenderyuk, V.V.; Zhuravleva, I.L.; Yakush, E.V.,
Analogy of sorption properties of alkylthiazoles and alkyl-oxazoles and its use for the calculation of retention indexes in capillary gas chromatography,
Zh. Anal. Khim., 1991, 46, 2, 313-319. [all data]
Lorenz, Stern, et al., 1983
Lorenz, G.; Stern, D.J.; Flath, R.A.; Haddon, W.F.; Tillin, S.J.; Teranishi, R.,
Identification of sheep liver volatiles,
J. Agric. Food Chem., 1983, 31, 5, 1052-1057, https://doi.org/10.1021/jf00119a033
. [all data]