1-Hexanol, 5-methyl-2-(1-methylethyl)-, acetate
- Formula: C12H24O2
- Molecular weight: 200.3178
- IUPAC Standard InChIKey: QLFSGYMLVZGFJT-UHFFFAOYSA-N
- CAS Registry Number: 40853-55-2
- Chemical structure:
View 3d structure (requires JavaScript / HTML 5) - Other names: 2-Isopropyl-5-methylhexyl acetate; Tetrahydrolavandulyl acetate; 1-Hexanol, 2-isopropyl-5-methyl-, acetate

Kovats' RI, non-polar column, isothermal

Column type | Active phase | Temperature (C) | I | Reference | Comment |
---|---|---|---|---|---|
Capillary | SE-30 | 100. | 1254.3 | Tudor, 1997 | 40. m/0.35 mm/0.35 μm |

Normal alkane RI, non-polar column, custom temperature program

Column type | Active phase | I | Reference | Comment |
---|---|---|---|---|
Capillary | SE-30 | 1260. | Vinogradov, 2004 | Program: not specified |
Capillary | Methyl Silicone | 1260. | Zenkevich, 1999 | Program: not specified |

References

Tudor, 1997
Tudor, E.,
Temperature dependence of the retention index for perfumery compounds on a SE-30 glass capillary column. I. Linear equations,
J. Chromatogr. A, 1997, 779, 1-2, 287-297, https://doi.org/10.1016/S0021-9673(97)00453-6
. [all data]
Vinogradov, 2004
Vinogradov, B.A.,
Production, composition, properties and application of essential oils, 2004, retrieved from http://viness.narod.ru. [all data]
Zenkevich, 1999
Zenkevich, I.G.,
Analytical Parameters of Components of essential Oils for their Gas Chromatographic and Chromato-Mass-Spectral Identification. Acetates of Terpene Alcohols,
Rastitelnye Resursy (Plant Resources), 1999, 35, 1, 30-37. [all data]