C(CH3)2
- Formula: C3H6
- Molecular weight: 42.0797
- IUPAC Standard InChIKey: IPZJQDSFZGZEOY-UHFFFAOYSA-N
- CAS Registry Number: 40852-89-9
- Chemical structure:
View 3d structure (requires JavaScript / HTML 5) - Permanent link for this species. Use this link for bookmarking this species for future reference.

Reaction thermochemistry data

Data compiled by: Robert C. Dunbar
Individual Reactions
By formula: Cr+ + C3H6 = (Cr+ • C3H6)
Quantity | Value | Units | Method | Reference | Comment |
---|---|---|---|---|---|
ΔrH° | 163. ± 13. | kJ/mol | CIDT | Fisher and Armentrout, 1992 |

Ion clustering data

Data compiled by: Robert C. Dunbar
Clustering reactions
By formula: Cr+ + C3H6 = (Cr+ • C3H6)
Quantity | Value | Units | Method | Reference | Comment |
---|---|---|---|---|---|
ΔrH° | 163. ± 13. | kJ/mol | CIDT | Fisher and Armentrout, 1992 |

References

Fisher and Armentrout, 1992
Fisher, E.R.; Armentrout, P.B.,
Activation of Alkanes by Cr+: Unique Reactivity of Ground-State Cr+(6S) and Thermochemistry of Neutral and Ionic Chromium-Carbon Bonds,
J. Am. Chem. Soc., 1992, 114, 6, 2039, https://doi.org/10.1021/ja00032a017
. [all data]