1H-Tetrazole, 5-methyl-
- Formula: C2H4N4
- Molecular weight: 84.0800
- IUPAC Standard InChIKey: XZGLNCKSNVGDNX-UHFFFAOYSA-N
- CAS Registry Number: 4076-36-2
- Chemical structure:
View 3d structure (requires JavaScript / HTML 5) - Other names: 5-Methyltetrazole; 2H-Tetrazole, 5-methyl-; 5-Methyl-1H-tetrazole

Gas phase thermochemistry data

Data compiled by: Hussein Y. Afeefy, Joel F. Liebman, and Stephen E. Stein
Quantity | Value | Units | Method | Reference | Comment |
---|---|---|---|---|---|
ΔfH°gas | 280.7 ± 2.6 | kJ/mol | Ccb | Kozyro, Simirskii, et al., 1990 |

Condensed phase thermochemistry data

Data compiled by: Hussein Y. Afeefy, Joel F. Liebman, and Stephen E. Stein
Quantity | Value | Units | Method | Reference | Comment |
---|---|---|---|---|---|
ΔfH°solid | 184.4 ± 2.6 | kJ/mol | Ccb | Kozyro, Simirskii, et al., 1990 | |
Quantity | Value | Units | Method | Reference | Comment |
ΔcH°solid | -1543.1 ± 2.5 | kJ/mol | Ccb | Kozyro, Simirskii, et al., 1990 |

Phase change data

Data compiled as indicated in comments:
TRC - Thermodynamics Research Center, NIST Boulder Laboratories, Chris Muzny director
ALS - Hussein Y. Afeefy, Joel F. Liebman, and Stephen E. Stein
DRB - Donald R. Burgess, Jr.
AC - William E. Acree, Jr., James S. Chickos
Quantity | Value | Units | Method | Reference | Comment |
---|---|---|---|---|---|
Ttriple | 418. | K | N/A | Kozyro, Simirskii, et al., 1990, 2 | Uncertainty assigned by TRC = 1. K; Det. with triple heat bridge; TRC |
Ttriple | 420. | K | N/A | Vorob'eva, 1990 | Uncertainty assigned by TRC = 1. K; TRC |
Quantity | Value | Units | Method | Reference | Comment |
ΔsubH° | 96.3 ± 0.5 | kJ/mol | V | Kozyro, Simirskii, et al., 1990 | ALS |
ΔsubH° | 96.3 | kJ/mol | N/A | Kozyro, Simirskii, et al., 1990 | DRB |
Enthalpy of sublimation
ΔsubH (kJ/mol) | Temperature (K) | Method | Reference | Comment |
---|---|---|---|---|
93.8 ± 0.5 | 323. to 418. | ME | Kozyro, Simirskii, et al., 1990, 3 | AC |
Enthalpy of fusion
ΔfusH (kJ/mol) | Temperature (K) | Reference | Comment |
---|---|---|---|
16.0 | 418. | Kozyro, Simirskii, et al., 1990, 4 | AC |

References

Kozyro, Simirskii, et al., 1990
Kozyro, A.A.; Simirskii, V.V.; Krasulin, A.P.; Sevruk, V.M.; Kabo, G.Ya.; Frenkel, M.L.; Gaponik, P.N.; Grigor'ev, Yu.V.,
Thermodynamic properties of tetrazole derivatives in different aggregation states,
Russ. J. Phys. Chem. (Engl. Transl.), 1990, 64, 348-350. [all data]
Kozyro, Simirskii, et al., 1990, 2
Kozyro, A.A.; Simirskii, V.V.; Kabo, G.Y.; Frenkel, M.L.; Krasulin, A.P.; Sevruk, V.M.; Sokolov, N.A.,
Additivity of the thermochemical characteristics of tetraalklyl-substituted carbamides,
Zh. Fiz. Khim., 1990, 64, 2360. [all data]
Vorob'eva, 1990
Vorob'eva, V.P.,
Enthalpies of phase transitions of tetrazole derivatives
in Vses. Konf. Term. Org. Soedin. 6th, Minsk, p 31, 1990. [all data]
Kozyro, Simirskii, et al., 1990, 3
Kozyro, A.A.; Simirskii, V.V.; Krasulin, A.P.; Sevruk, V.M.; Kabo, G.Y.; Frenkel, M.L.; Gaponik, P.N.; Grigor'ev, Y.V.,
Russ. J. Phys. Chem., 1990, 64, 348. [all data]
Kozyro, Simirskii, et al., 1990, 4
Kozyro, A.A.; Simirskii, V.V.; Krasulin, A.P.; Sevruk, V.M.; Kabo, G.Y.; Frenkel, M.L.; Gaponik, P.N.; Grigor'ev, Y.V.,
Thermodynamic properties of tetrazole derivatives in different aggregation states,
Zh. Fiz. Khim., 1990, 64, 656. [all data]