Acetic acid, trifluoro-, anhydride
- Formula: C4F6O3
- Molecular weight: 210.0314
- IUPAC Standard InChIKey: QAEDZJGFFMLHHQ-UHFFFAOYSA-N
- CAS Registry Number: 407-25-0
- Chemical structure:
View 3d structure (requires JavaScript / HTML 5) - Other names: Bis(trifluoroacetic) anhydride; Hexafluoroacetic anhydride; Perfluoroacetic anhydride; Trifluoroacetic acid anhydride; Trifluoroacetic anhydride; Trifluoroacetyl anhydride; Anhydrid kyseliny trifluoroctove

Phase change data

Data compiled as indicated in comments:
BS - Robert L. Brown and Stephen E. Stein
AC - William E. Acree, Jr., James S. Chickos
Quantity | Value | Units | Method | Reference | Comment |
---|---|---|---|---|---|
Tboil | 312.6 to 313. | K | N/A | Farchan Laboratories, 1990 | BS |
Tboil | 312.6 to 313.6 | K | N/A | PCR Inc., 1990 | BS |
Tboil | 312.7 | K | N/A | Weast and Grasselli, 1989 | BS |
Enthalpy of vaporization
ΔvapH (kJ/mol) | Temperature (K) | Method | Reference | Comment |
---|---|---|---|---|
34.7 | 286. | A | Stephenson and Malanowski, 1987 | Based on data from 271. to 312. K. See also Kreglewski, 1962 and Dykyj, 1971.; AC |
Antoine Equation Parameters
log10(P) = A − (B / (T + C))
P = vapor pressure (bar)
T = temperature (K)
View plot Requires a JavaScript / HTML 5 canvas capable browser.
Temperature (K) | A | B | C | Reference | Comment |
---|---|---|---|---|---|
271.32 to 312.02 | 3.17534 | 987.921 | -75.417 | Kreglewski, 1962, 2 | Coefficents calculated by NIST from author's data. |

Reaction thermochemistry data

Data compiled by: Hussein Y. Afeefy, Joel F. Liebman, and Stephen E. Stein
Individual Reactions
By formula: C4F6O3 + C5H10O = C7H9F3O2 + C2HF3O2
Quantity | Value | Units | Method | Reference | Comment |
---|---|---|---|---|---|
ΔrH° | -92.96 ± 0.23 | kJ/mol | Cac | Wiberg, Wasserman, et al., 1985 | liquid phase; solvent: Trifluoroactic acid; Trifluoroacetolysis |
By formula: C4F6O3 + C7H12O = C9H11F3O2 + C2HF3O2
Quantity | Value | Units | Method | Reference | Comment |
---|---|---|---|---|---|
ΔrH° | -91.09 ± 0.14 | kJ/mol | Cac | Wiberg, Wasserman, et al., 1985 | liquid phase; Trifluoroacetolysis |
By formula: C6H12O + C4F6O3 = C8H11F3O2 + C2HF3O2
Quantity | Value | Units | Method | Reference | Comment |
---|---|---|---|---|---|
ΔrH° | -90.06 ± 0.15 | kJ/mol | Cac | Wiberg, Wasserman, et al., 1985 | liquid phase; Trifluoroacetolysis |
By formula: C4F6O3 + C5H12O = C7H11F3O2 + C2HF3O2
Quantity | Value | Units | Method | Reference | Comment |
---|---|---|---|---|---|
ΔrH° | -88.53 ± 0.08 | kJ/mol | Cm | Wiberg and Hao, 1991 | liquid phase; Trifuoroacetolysis |
By formula: C4F6O3 + C6H14O = C2HF3O2 + C8H13F3O2
Quantity | Value | Units | Method | Reference | Comment |
---|---|---|---|---|---|
ΔrH° | -89.33 ± 0.04 | kJ/mol | Cm | Wiberg and Wasserman, 1981 | liquid phase |
By formula: C4F6O3 + C6H14O = C2HF3O2 + C8H13F3O2
Quantity | Value | Units | Method | Reference | Comment |
---|---|---|---|---|---|
ΔrH° | -92.68 ± 0.04 | kJ/mol | Cm | Wiberg and Wasserman, 1981 | liquid phase |
By formula: C4F6O3 + H2O = 2C2HF3O2
Quantity | Value | Units | Method | Reference | Comment |
---|---|---|---|---|---|
ΔrH° | -75.35 ± 0.04 | kJ/mol | Cm | Wiberg and Wasserman, 1981 | liquid phase |
+
= C2F3NO4 +
By formula: C4F6O3 + HNO3 = C2F3NO4 + C2HF3O2
Quantity | Value | Units | Method | Reference | Comment |
---|---|---|---|---|---|
ΔrH° | -27.6 | kJ/mol | Cm | Tsvetkov, Shmakov, et al., 1989 | liquid phase |

Normal alkane RI, non-polar column, temperature ramp

Column type | Active phase | I | Reference | Comment |
---|---|---|---|---|
Capillary | OV-101 | 515. | Zenkevich and Rodin, 2002 | Nitrogen, 60. C @ 0. min, 4. K/min, 240. C @ 0. min; Column length: 25. m; Column diameter: 0.25 mm |

Normal alkane RI, non-polar column, custom temperature program

Column type | Active phase | I | Reference | Comment |
---|---|---|---|---|
Capillary | Polydimethyl siloxanes | 515. | Zenkevich, 2001 | Program: not specified |

References

Farchan Laboratories, 1990
Farchan Laboratories,
Research Chemicals Catalog, Farchan Laboratories, Gainesville, FL, 1990, 91. [all data]
PCR Inc., 1990
PCR Inc.,
Research Chemicals Catalog 1990-1991, PCR Inc., Gainesville, FL, 1990, 1. [all data]
Weast and Grasselli, 1989
CRC Handbook of Data on Organic Compounds, 2nd Editon, Weast,R.C and Grasselli, J.G., ed(s)., CRC Press, Inc., Boca Raton, FL, 1989, 1. [all data]
Stephenson and Malanowski, 1987
Stephenson, Richard M.; Malanowski, Stanislaw,
Handbook of the Thermodynamics of Organic Compounds, 1987, https://doi.org/10.1007/978-94-009-3173-2
. [all data]
Kreglewski, 1962
Kreglewski, A.,
Bull. Pol. Acad. Sci., Ser. Sci. Chem., 1962, 10, 629. [all data]
Dykyj, 1971
Dykyj, J.,
Petrochemia, 1971, 11, 2, 27. [all data]
Kreglewski, 1962, 2
Kreglewski, A.,
Vapour Pressures and Molar Volumes of Liquid Perfluoro-n-Octane Trifluoracetic Acid, and its Anhydride,
Bull. Acad. Pol. Sci. Ser. Sci. Chim., 1962, 10, 11-12, 629-633. [all data]
Wiberg, Wasserman, et al., 1985
Wiberg, K.B.; Wasserman, D.J.; Martin, E.J.; Murcko, M.A.,
Enthalpies of hydration of alkenes. 3. Cycloalkenes,
J. Am. Chem. Soc., 1985, 107, 6019-6022. [all data]
Wiberg and Hao, 1991
Wiberg, K.B.; Hao, S.,
Enthalpies of hydration of alkenes. 4. Formation of acyclic tert-alcohols,
J. Org. Chem., 1991, 56, 5108-5110. [all data]
Wiberg and Wasserman, 1981
Wiberg, K.B.; Wasserman, D.J.,
Enthalpies of hydration of alkenes. 1. The n-hexenes,
J. Am. Chem. Soc., 1981, 103, 6563-6566. [all data]
Tsvetkov, Shmakov, et al., 1989
Tsvetkov, V.G.; Shmakov, V.A.; Sopin, V.F.; Ivanov, A.V.; Ikonnikov, A.A.; Marchenko, G.N.,
Enthalpies of reaction of nitric acid with acetic and trifluoroacetic anhydrides,
J. Gen. Chem. USSR, 1989, 59, 1220-1222. [all data]