Myricetin 6TMS
- Formula: C33H58O8Si6
- Molecular weight: 751.3218
- IUPAC Standard InChIKey: QWDLZFLTUKTITG-UHFFFAOYSA-N
- CAS Registry Number: 4067-68-9
- Chemical structure:
- Other names: 3,5,7-Tris((trimethylsilyl)oxy)-2-(3,4,5-tris((trimethylsilyl)oxy)phenyl)-4H-chromen-4-one; 4H-1-Benzopyran-4-one, 3,5,7-tris[(trimethylsilyl)oxy]-2-[3,4,5-tris[(trimethylsilyl)oxy]phenyl]-; Flavone, 3,3',4',5,5',7-hexakis(trimethylsiloxy)-

Van Den Dool and Kratz RI, non-polar column, custom temperature program

Column type | Active phase | I | Reference | Comment |
---|---|---|---|---|
Capillary | HP-5MS | 3207.3 | Andriamaharavo, 2014 | 30. m/0.25 mm/0.25 μm, He; Program: 60C (1 min) => 5 C/min => 210C => 10 C/min => 280C (15 min) |

References

Andriamaharavo, 2014
Andriamaharavo, N.R.,
Retention Data. NIST Mass Spectrometry Data Center., NIST Mass Spectrometry Data Center, 2014. [all data]