Benzaldehyde, 4-(2-propenyloxy)-
- Formula: C10H10O2
- Molecular weight: 162.1852
- IUPAC Standard InChIKey: TYNJQOJWNMZQFZ-UHFFFAOYSA-N
- CAS Registry Number: 40663-68-1
- Chemical structure:
View 3d structure (requires JavaScript / HTML 5) - Other names: p-(Allyloxy)benzaldehyde; 4-(Allyloxy)benzaldehyde

Phase change data

Data compiled by: Robert L. Brown and Stephen E. Stein
Reduced pressure boiling point
Tboil (K) | Pressure (bar) | Reference |
---|---|---|
423. to 426. | 0.023 | Frinton Laboratories Inc., 1986 |

References

Frinton Laboratories Inc., 1986
Frinton Laboratories Inc.,
Catalog Number 11, Frinton Laboratories Inc., Vineland, NJ, 1986, 99. [all data]