Z-4-Dodecenol
- Formula: C12H24O
- Molecular weight: 184.3184
- IUPAC Standard InChIKey: HPSZLHZEQBRQIA-HJWRWDBZSA-N
- CAS Registry Number: 40642-37-3
- Chemical structure:
View 3d structure (requires JavaScript / HTML 5) - Stereoisomers:
- Other names: (4Z)-4-Dodecen-1-ol; 4-Dodecenol, Z; (Z)-4-Dodecen-1-ol; cis-4-Dodecen-1-ol

Van Den Dool and Kratz RI, non-polar column, temperature ramp

Column type | Active phase | I | Reference | Comment |
---|---|---|---|---|
Capillary | DB-5 | 1457. | Marques, McElfresh, et al., 2000 | 30. m/0.25 mm/0.25 μm, 100. C @ 1. min, 5. K/min, 275. C @ 3. min |

Van Den Dool and Kratz RI, polar column, temperature ramp

Column type | Active phase | I | Reference | Comment |
---|---|---|---|---|
Capillary | DB-Wax | 1996. | Marques, McElfresh, et al., 2000 | 30. m/0.32 mm/0.25 μm, 100. C @ 1. min, 5. K/min; Tend: 240. C |

Normal alkane RI, polar column, isothermal

Column type | Active phase | Temperature (C) | I | Reference | Comment |
---|---|---|---|---|---|
Capillary | PEG | 160. | 2016. | Guo, Yuan, et al., 1984 | Column length: 30. m; Column diameter: 0.36 mm |
Capillary | FFAP | 210. | 1995. | Guo, Yuan, et al., 1984 | Column length: 80. m; Column diameter: 0.30 mm |

References

Marques, McElfresh, et al., 2000
Marques, F.A.; McElfresh, J.S.; Millar, J.G.,
Kováts retention indexes of monounsaturated C12, C14, and C16 alcohols, acetates and aldehydes commonly found in lepidopteran pheromone blends,
J. Braz. Chem. Soc., 2000, 11, 6, 592-599, https://doi.org/10.1590/S0103-50532000000600007
. [all data]
Guo, Yuan, et al., 1984
Guo, G.; Yuan, M.; Lin, G.,
Study on the resolution of geometric isomers of insect sex pheromones with capillary column GC,
You ji hua xue, 1984, 5, 349-354. [all data]