1-Propene, 1-fluoro
- Formula: C3H5F
- Molecular weight: 60.0702
- IUPAC Standard InChIKey: VJGCZWVJDRIHNC-UHFFFAOYSA-N
- CAS Registry Number: 406-33-7
- Chemical structure:
View 3d structure (requires JavaScript / HTML 5) - Stereoisomers:

Reaction thermochemistry data

Data compiled by: Hussein Y. Afeefy, Joel F. Liebman, and Stephen E. Stein
Individual Reactions
By formula: C3H5F = C3H5F
Quantity | Value | Units | Method | Reference | Comment |
---|---|---|---|---|---|
ΔrH° | -17.4 ± 0.42 | kJ/mol | Ciso | Abell and Adolf, 1969 | gas phase; HBr catalyst |

References

Abell and Adolf, 1969
Abell, P.I.; Adolf, P.K.,
HBr catalyzed photoisomerization of allyl halides,
J. Chem. Thermodyn., 1969, 1, 333-338. [all data]