Cyclopentanamine, 1-methyl-
- Formula: C6H13N
- Molecular weight: 99.1741
- IUPAC Standard InChIKey: TWASBYPJZBHZQJ-UHFFFAOYSA-N
- CAS Registry Number: 40571-45-7
- Chemical structure:
View 3d structure (requires JavaScript / HTML 5) - Species with the same structure:
- Other names: 1-methylcyclopentanamine

Phase change data

Data compiled by: Thermodynamics Research Center, NIST Boulder Laboratories, Chris Muzny director
Quantity | Value | Units | Method | Reference | Comment |
---|---|---|---|---|---|
Tboil | 273.15 | K | N/A | Cope, Bumgardner, et al., 1957 | Uncertainty assigned by TRC = 4. K |

Normal alkane RI, non-polar column, temperature ramp

Column type | Active phase | I | Reference | Comment |
---|---|---|---|---|
Capillary | OV-101 | 789. | Zenkevich, 2005 | 25. m/0.20 mm/0.10 μm, N2/He, 6. K/min; Tstart: 50. C; Tend: 250. C |

References

Cope, Bumgardner, et al., 1957
Cope, A.C.; Bumgardner, C.L.; Schweizer, E.E.,
Amine Oxides IV. Alicyclic Olefins from Aine Oxides and Quaternary Ammonium Hydroxides,
J. Am. Chem. Soc., 1957, 79, 4729-33. [all data]
Zenkevich, 2005
Zenkevich, I.G.,
Experimentally measured retention indices., 2005. [all data]