2-Acetyl-1,3-cyclohexanedione
- Formula: C8H10O3
- Molecular weight: 154.1632
- IUPAC Standard InChIKey: CHNXDYRMRBQOEF-UHFFFAOYSA-N
- CAS Registry Number: 4056-73-9
- Chemical structure:
View 3d structure (requires JavaScript / HTML 5) - Other names: 1,3-Cyclohexanedione, 2-acetyl-

Phase change data

Data compiled by: Robert L. Brown and Stephen E. Stein
Quantity | Value | Units | Method | Reference | Comment |
---|---|---|---|---|---|
Tfus | 302. to 305. | K | N/A | Buckingham and Donaghy, 1982 |
Reduced pressure boiling point
Tboil (K) | Pressure (bar) | Reference |
---|---|---|
399.7 | 0.029 | Weast and Grasselli, 1989 |
399. to 400. | 0.029 | Buckingham and Donaghy, 1982 |

References

Buckingham and Donaghy, 1982
Buckingham, J.; Donaghy, S.M.,
Dictionary of Organic Compounds: Fifth Edition, Chapman and Hall, New York, 1982, 1. [all data]
Weast and Grasselli, 1989
CRC Handbook of Data on Organic Compounds, 2nd Editon, Weast,R.C and Grasselli, J.G., ed(s)., CRC Press, Inc., Boca Raton, FL, 1989, 1. [all data]