Butane, 1-chloro-2-methyl-, (S)-
- Formula: C5H11Cl
- Molecular weight: 106.594
- IUPAC Standard InChIKey: IWAKWOFEHSYKSI-RXMQYKEDSA-N
- CAS Registry Number: 40560-29-0
- Chemical structure:
View 3d structure (requires JavaScript / HTML 5) - Stereoisomers:

Phase change data

Data compiled by: Thermodynamics Research Center, NIST Boulder Laboratories, Chris Muzny director
Quantity | Value | Units | Method | Reference | Comment |
---|---|---|---|---|---|
Tboil | 372.65 | K | N/A | Lardicci, Salvadori, et al., 1962 | Uncertainty assigned by TRC = 1. K |
Tboil | 372.7 | K | N/A | Pino, Lardicci, et al., 1959 | Uncertainty assigned by TRC = 3. K |

References

Lardicci, Salvadori, et al., 1962
Lardicci, L.; Salvadori, R.; Pino, P.,
Preparation of Optically Active Paraffins and Alcohols by Addition of Ethylene to (D)(+)-2-methylbutyl-1-lithium,
Ann. Chim. (Rome), 1962, 52, 652-62. [all data]
Pino, Lardicci, et al., 1959
Pino, P.; Lardicci, L.; Centoni, L.,
Synthesis of (+)(S)-3-methyl-1-pentene,
J. Org. Chem., 1959, 24, 1399-14-3. [all data]