2-Phenethyl phenyl ether
- Formula: C14H14O
- Molecular weight: 198.2604
- IUPAC Standard InChIKey: JKSGBCQEHZWHHL-UHFFFAOYSA-N
- CAS Registry Number: 40515-89-7
- Chemical structure:
View 3d structure (requires JavaScript / HTML 5) - Other names: 2-Phenylethyl phenyl ether

Phase change data

Data compiled by: Robert L. Brown and Stephen E. Stein
Reduced pressure boiling point
Tboil (K) | Pressure (bar) | Reference |
---|---|---|
437. to 439. | 0.019 | Frinton Laboratories Inc., 1986 |

References

Frinton Laboratories Inc., 1986
Frinton Laboratories Inc.,
Catalog Number 11, Frinton Laboratories Inc., Vineland, NJ, 1986, 99. [all data]