Triphenyl vinylgermanium

Phase change data

Data compiled by: William E. Acree, Jr., James S. Chickos

Quantity Value Units Method Reference Comment
Δsub23.6 ± 0.38kcal/molME,TECarson, Jamea, et al., 1988

References

Carson, Jamea, et al., 1988
Carson, A.S.; Jamea, E.H.; Laye, P.G.; Spencer, J.A., The enthalpies of formation of triphenyl vinyl germanium, triphenyl phenylethynyl germanium, bis(triphenyl germanium) oxide, and some associated Ge«58872»C bond enthalpies, The Journal of Chemical Thermodynamics, 1988, 20, 10, 1223-1229, https://doi.org/10.1016/0021-9614(88)90107-3 . [all data]