1,3,4,5-Tetramethyl-2-methylenebicyclo[3.1.0]hex-3-ene
- Formula: C11H16
- Molecular weight: 148.2447
- IUPAC Standard InChIKey: RPNFTZLYTXXLRA-UHFFFAOYSA-N
- CAS Registry Number: 40430-32-8
- Chemical structure:
View 3d structure (requires JavaScript / HTML 5) - Permanent link for this species. Use this link for bookmarking this species for future reference.

Reaction thermochemistry data

Data compiled by: Hussein Y. Afeefy, Joel F. Liebman, and Stephen E. Stein
Individual Reactions
By formula: C11H16 = C11H16
Quantity | Value | Units | Method | Reference | Comment |
---|---|---|---|---|---|
ΔrH° | -136. ± 3. | kJ/mol | Ciso | Childs and Mulholland, 1983 | liquid phase |

References

Childs and Mulholland, 1983
Childs, R.F.; Mulholland, D.L.,
Thermochemical relationships between some bicyclohexenyl and benzenium cations,
J. Am. Chem. Soc., 1983, 105, 96-99. [all data]