Cyclopentanone, 2,5-dimethyl-
- Formula: C7H12O
- Molecular weight: 112.1696
- IUPAC Standard InChIKey: MKLARKDYEBNZFK-UHFFFAOYSA-N
- CAS Registry Number: 4041-09-2
- Chemical structure:
View 3d structure (requires JavaScript / HTML 5) - Other names: 2,5-Dimethylcyclopentanone; 2,5-dimethylcyclopentan-1-one

Normal alkane RI, non-polar column, custom temperature program

Column type | Active phase | I | Reference | Comment |
---|---|---|---|---|
Capillary | Methyl Silicone | 855. | Zenkevich, 1998 | Program: not specified |

References

O'Sullivan and Testa, 1973
O'Sullivan, M.; Testa, A.C.,
J. Phys. Chem., 1973, 77, 1830. [all data]
Zenkevich, 1998
Zenkevich, I.G.,
Non-Traditional Criteria for Gas-Chromatographic and Chromato-Mass-Spectrometric Identification of Organic Compounds,
Zh. Anal. Khim., 1998, 53, 8, 828-835. [all data]