2,2',6,6'-tetramethyl-1,1'-biphenyl
- Formula: C16H18
- Molecular weight: 210.3141
- IUPAC Standard InChIKey: APHCWWQRFOQDBK-UHFFFAOYSA-N
- CAS Registry Number: 4036-43-5
- Chemical structure:
View 3d structure (requires JavaScript / HTML 5) - Permanent link for this species. Use this link for bookmarking this species for future reference.

Phase change data

Data compiled by: Thermodynamics Research Center, NIST Boulder Laboratories, Chris Muzny director
Quantity | Value | Units | Method | Reference | Comment |
---|---|---|---|---|---|
Tfus | 340.0 | K | N/A | Castro, Andrews, et al., 1958 | Uncertainty assigned by TRC = 1. K |

References

Castro, Andrews, et al., 1958
Castro, C.E.; Andrews, L.J.; Keefer, R.M.,
Molecular Complexes of Hindered Biphenyl Derivatives,
J. Am. Chem. Soc., 1958, 80, 2322-6. [all data]