Arsine, tris(2-chloroethenyl)-
- Formula: C6H6AsCl3
- Molecular weight: 259.392
- IUPAC Standard InChIKey: AOAVIJUEFJPSAI-GZDDRBCLSA-N
- CAS Registry Number: 40334-70-1
- Chemical structure:
View 3d structure (requires JavaScript / HTML 5) - Other names: Lewisite 3; tris(2-Chloroethenyl)arsine; tris-(2-Chlorovinyl) arsine; Lewisite III

Van Den Dool and Kratz RI, non-polar column, temperature ramp

Column type | Active phase | I | Reference | Comment |
---|---|---|---|---|
Capillary | SE-54 | 1465. | Kostiainen, 2000 | 25. m/0.32 mm/0.25 μm, He, 40. C @ 1. min, 10. K/min, 280. C @ 10. min |

Normal alkane RI, non-polar column, temperature ramp

Column type | Active phase | I | Reference | Comment |
---|---|---|---|---|
Capillary | DB-5 | 1454. | Hanaoka, Nomura, et al., 2006 | 30. m/0.32 mm/0.25 μm, He, 100. C @ 5. min, 10. K/min; Tend: 280. C |

Normal alkane RI, non-polar column, custom temperature program

Column type | Active phase | I | Reference | Comment |
---|---|---|---|---|
Capillary | Polydimethyl siloxane | 1465. | Staples, 2006 | Program: not specified |
Capillary | 5 % Phenyl methyl siloxane | 1465. | OPCW, 1997 | Program: not specified |

References

Kostiainen, 2000
Kostiainen, O.,
Gas Chromatography in Screening of Chemicals Related to the Chemical Weapons Convention
in Encyclopedia of Analytical Chemistry, Meyers, R.A., ed(s)., John Wiley Sons Ltd, Chichester, 2000, 963-979. [all data]
Hanaoka, Nomura, et al., 2006
Hanaoka, S.; Nomura, K.; Wada, T.,
Determination of mustard and lewisite related compounds in abandoned chemical weapons (Yellow shells) from sources in China and Japan,
J. Chromatogr. A, 2006, 1101, 1-2, 268-277, https://doi.org/10.1016/j.chroma.2005.10.028
. [all data]
Staples, 2006
Staples, E.J.,
Creating a compound library for chemical warfare agents for the ZNose, 2006, retrieved from http://www.estcal.com/TechPapers/Security/CWA-Libraries.pdf. [all data]
OPCW, 1997
OPCW,
Conference of the States Parties C-I/DEC.64 (22 May 1997), 1997, retrieved from http://www.opcw.org/html/global/cseries/csp1/CIDEC64.html. [all data]