Octane, 2,4-dimethyl-
- Formula: C10H22
- Molecular weight: 142.2817
- IUPAC Standard InChIKey: IXAVTTRPEXFVSX-UHFFFAOYSA-N
- CAS Registry Number: 4032-94-4
- Chemical structure:
View 3d structure (requires JavaScript / HTML 5) - Other names: 2,4-dimethyloctane

Phase change data

Data compiled as indicated in comments:
TRC - Thermodynamics Research Center, NIST Boulder Laboratories, Chris Muzny director
AC - William E. Acree, Jr., James S. Chickos
Quantity | Value | Units | Method | Reference | Comment |
---|---|---|---|---|---|
Tboil | 429.05 | K | N/A | Levina, Tantsyreva, et al., 1951 | Uncertainty assigned by TRC = 0.5 K; TRC |
Quantity | Value | Units | Method | Reference | Comment |
ΔvapH° | 48.5 | kJ/mol | N/A | Reid, 1972 | AC |
Enthalpy of vaporization
ΔvapH (kJ/mol) | Temperature (K) | Method | Reference | Comment |
---|---|---|---|---|
44.9 ± 0.2 | 328. | C | Majer, Svoboda, et al., 1984 | AC |
43.6 ± 0.2 | 343. | C | Majer, Svoboda, et al., 1984 | AC |
42.4 ± 0.2 | 358. | C | Majer, Svoboda, et al., 1984 | AC |

Kovats' RI, non-polar column, custom temperature program

Data compiled by: NIST Mass Spectrometry Data Center, William E. Wallace, director

Column type CapillaryCapillaryCapillary
Active phase Petrocol DH-100SqualaneSqualane
Column length (m) 100.
Carrier gas He
Substrate
Column diameter (mm) 0.2
Phase thickness (μm)
Program 5C(10min) => 5C/min => 50C(48min) => 1.5C/min => 195C(91min)not specifiednot specified
I 924.4914.916.
ReferenceHaagen-Smit Laboratory, 1997Korol and Lysyuk, 1980Korol and Lysyuk, 1980
Comment MSDC-RI MSDC-RI MSDC-RI

References

Levina, Tantsyreva, et al., 1951
Levina, R.Ya.; Tantsyreva, T.I.; Fainzil'berg, A.A.; Mezentsova, N.N.,
Synthesis of HydrocarbonsXXIV. Synthesis of Alkanes with Iso-Structure,
Izv. Akad. Nauk SSSR, Ser. Khim., 1951, No. 2, 161-165. [all data]
Reid, 1972
Reid, Robert C.,
Handbook on vapor pressure and heats of vaporization of hydrocarbons and related compounds, R. C. Wilhort and B. J. Zwolinski, Texas A Research Foundation. College Station, Texas(1971). 329 pages.$10.00,
AIChE J., 1972, 18, 6, 1278-1278, https://doi.org/10.1002/aic.690180637
. [all data]
Majer, Svoboda, et al., 1984
Majer, V.; Svoboda, V.; Lencka, M.,
Enthalpies of vaporization and cohesive energies of pyridine and isomeric methylpyridines,
J. Chem. Thermodyn., 1984, 16, 1019-1024. [all data]