Heptane, 2,3,6-trimethyl-
- Formula: C10H22
- Molecular weight: 142.2817
- IUPAC Standard InChIKey: IHPXJGBVRWFEJB-UHFFFAOYSA-N
- CAS Registry Number: 4032-93-3
- Chemical structure:
View 3d structure (requires JavaScript / HTML 5) - Other names: 2,3,6-Trimethylheptane

Phase change data

Data compiled as indicated in comments:
TRC - Thermodynamics Research Center, NIST Boulder Laboratories, Chris Muzny director
AC - William E. Acree, Jr., James S. Chickos
Quantity | Value | Units | Method | Reference | Comment |
---|---|---|---|---|---|
Tboil | 410.64 | K | N/A | Anonymous, 1959 | Uncertainty assigned by TRC = 0.4 K; TRC |
Tboil | 429.15 | K | N/A | Fenske, Braun, et al., 1947 | Uncertainty assigned by TRC = 0.3 K; TRC |
Tboil | 428.4 | K | N/A | Cline, 1939 | Uncertainty assigned by TRC = 0.5 K; TRC |
Quantity | Value | Units | Method | Reference | Comment |
ΔvapH° | 47.3 | kJ/mol | N/A | Reid, 1972 | AC |

Henry's Law data

Data compiled by: Rolf Sander
Henry's Law constant (water solution)
kH(T) = k°H exp(d(ln(kH))/d(1/T) ((1/T) - 1/(298.15 K)))
k°H = Henry's law constant for solubility in water at 298.15 K (mol/(kg*bar))
d(ln(kH))/d(1/T) = Temperature dependence constant (K)
k°H (mol/(kg*bar)) | d(ln(kH))/d(1/T) (K) | Method | Reference | Comment |
---|---|---|---|---|
0.00016 | Q | N/A | missing citation give several references for the Henry's law constants but don't assign them to specific species. |

Kovats' RI, non-polar column, isothermal

Column type | Active phase | Temperature (C) | I | Reference | Comment |
---|---|---|---|---|---|
Capillary | Squalane | 100. | 919. | Heinzen, Soares, et al., 1999 | |
Capillary | Squalane | 60. | 919. | Chretien and Dubois, 1976 | |
Capillary | Squalane | 60. | 919. | Matukuma, 1969 | N2; Column length: 91.4 m; Column diameter: 0.25 mm |

Kovats' RI, non-polar column, custom temperature program

Column type | Active phase | I | Reference | Comment |
---|---|---|---|---|
Capillary | Squalane | 919. | Korol and Lysyuk, 1980 | Program: not specified |

Normal alkane RI, non-polar column, custom temperature program

Column type | Active phase | I | Reference | Comment |
---|---|---|---|---|
Capillary | OV-101 | 919. | Du and Liang, 2003 | Program: not specified |
Capillary | Polydimethyl siloxane | 919. | Junkes, Castanho, et al., 2003 | Program: not specified |

References

Anonymous, 1959
Anonymous, R.,
, Am. Pet. Inst. Res. Proj. 6, Carnegie-Mellon Univ., 1959. [all data]
Fenske, Braun, et al., 1947
Fenske, M.R.; Braun, W.G.; Wiegand, R.V.; Quiggle, D.; McCormick, R.H.; Rank, D.H.,
Raman Spectra of Hydrocarbons,
Anal. Chem., 1947, 19, 700. [all data]
Cline, 1939
Cline, E.T.,
The Synthesis of Type III and Type V Olefins from Dimethylbutadien- monohydrobromide, Ph.D. Dissertation, Ohio State Univ., Columbus, OH, 1939. [all data]
Reid, 1972
Reid, Robert C.,
Handbook on vapor pressure and heats of vaporization of hydrocarbons and related compounds, R. C. Wilhort and B. J. Zwolinski, Texas A Research Foundation. College Station, Texas(1971). 329 pages.$10.00,
AIChE J., 1972, 18, 6, 1278-1278, https://doi.org/10.1002/aic.690180637
. [all data]